program: Orca
programVersion: 5.0.2
elementType: N N N N N C C C C C C C C C C C C C C C H H H H H H H H H H H H H H H H H H H H H H H H H
charge: 0
multiplicity: 1
keywords: wb97x-d3
keywords: def2-TZVPP
keywords: def2/J RIJCOSX
keywords: DEFGRID2
keywords: scfconv7
keywords: smallprint printgap noloewdin
keywords: NOSOSCF
formula: C15H25N5
InChI: InChI=1/C15H25N5/c1-3-5-6-7-8-9-10-12-13(4-2)19-15-17-11-18-20(15)14(12)16/h11H,3-10,16H2,1-2H3
45 atoms
N  -0.015296 -2.476234 1.744249
N  0.168125 -2.489922 -0.602527
N  0.952826 -0.964399 3.166184
N  -0.597361 -3.175879 2.729477
N  -1.094498 -4.064741 0.708703
C  0.335379 2.097458 0.106967
C  1.328496 1.697475 1.188771
C  -0.457123 3.348168 0.467457
C  2.12148 0.425471 0.861199
C  -1.560027 3.693157 -0.528335
C  1.274219 -0.813795 0.746459
C  -1.063736 4.033402 -1.92866
C  0.935941 -1.428794 -0.489317
C  -2.182095 4.493649 -2.855938
C  0.768794 -1.386164 1.900957
C  1.482156 -0.868421 -1.778929
C  -0.313892 -3.014648 0.517573
C  -1.693653 4.831476 -4.256646
C  1.032633 -1.606442 -3.027894
C  -1.22597 -4.107977 2.038922
H  -0.360814 1.271997 -0.075868
H  0.875141 2.25782 -0.831498
H  2.035921 2.516058 1.353085
H  0.789993 1.569245 2.132798
H  -0.906272 3.209447 1.455961
H  0.225987 4.199064 0.56393
H  2.895685 0.277312 1.624129
H  2.679747 0.58402 -0.061788
H  -2.266454 2.858263 -0.587461
H  -2.131538 4.541679 -0.139698
H  -0.566474 3.165863 -2.374156
H  -0.30049 4.817525 -1.863597
H  -2.675513 5.367413 -2.419549
H  -2.948238 3.714552 -2.913028
H  2.575916 -0.871069 -1.724647
H  1.201694 0.185919 -1.854475
H  -2.510868 5.162783 -4.897555
H  -0.949126 5.629103 -4.234282
H  -1.231705 3.966256 -4.734889
H  1.336599 -2.651001 -3.008089
H  1.47063 -1.139083 -3.909988
H  -0.050248 -1.588941 -3.13463
H  0.638498 -1.564493 3.910928
H  1.678219 -0.302889 3.368904
H  -1.813557 -4.861142 2.542125
totalener: -860.51248174 hartree
nucrepener: 1572.67659706 hartree
electener: -2433.18907880 hartree
oneelecener: -4287.16266645 hartree
twoeener: 1853.97358765 hartree
kineticenergy: 856.59988978 hartree
xcener: -85.956418782453 hartree
chargesum: -0.0000000
charge: 0.143134 -0.305373 -0.271656 -0.397609 -0.307220 -0.122261 -0.133504 -0.141389 -0.191678 -0.119976 -0.134982 -0.105651 0.193292 -0.086788 0.257091 -0.124770 0.201287 -0.253055 -0.241409 0.095227 0.082577 0.059392 0.078604 0.061318 0.070902 0.062570 0.094782 0.088751 0.062812 0.068472 0.053455 0.054062 0.052106 0.055256 0.077142 0.083164 0.085529 0.071173 0.071774 0.089166 0.078423 0.086427 0.172232 0.159848 0.127355
qa: 0.1431 -0.3054 -0.2717 -0.3976 -0.3072 -0.1223 -0.1335 -0.1414 -0.1917 -0.1200 -0.1350 -0.1057 0.1933 -0.0868 0.2571 -0.1248 0.2013 -0.2531 -0.2414 0.0952 0.0826 0.0594 0.0786 0.0613 0.0709 0.0626 0.0948 0.0888 0.0628 0.0685 0.0535 0.0541 0.0521 0.0553 0.0771 0.0832 0.0855 0.0712 0.0718 0.0892 0.0784 0.0864 0.1722 0.1598 0.1274
va: 3.3434 3.0048 3.2628 2.7710 3.0658 3.8462 3.8605 3.9398 3.8459 3.8918 3.6155 3.8681 3.7770 3.9024 4.0850 3.8883 4.3652 3.9514 3.9689 4.0712 1.0049 1.0057 1.0142 1.0214 1.0118 1.0102 1.0043 1.0171 1.0125 1.0136 1.0081 1.0095 1.0089 1.0071 0.9998 0.9975 1.0065 1.0031 1.0039 1.0127 1.0021 1.0118 1.0411 1.0280 1.0001
dispcorr: -0.019062644 hartree
energy: -860.531544383504
dipole: -0.36646 1.59596 1.22951 40.05176 -38.29163 1.76013 -20.59137 21.57577 0.98440
magnitude: 2.36194 au
magnitude: 6.00358 debye
