program: Orca
programVersion: 5.0.2
elementType: N N N N N C C C C C C C C C C C C C C C H H H H H H H H H H H H H H H H H H H H H H H H H
charge: 0
multiplicity: 1
keywords: wb97x-d3
keywords: def2-TZVPP
keywords: def2/J RIJCOSX
keywords: DEFGRID2
keywords: scfconv7
keywords: smallprint printgap noloewdin
keywords: NOSOSCF
formula: C15H25N5
InChI: InChI=1/C15H25N5/c1-3-5-6-7-8-9-10-12-13(4-2)19-15-17-11-18-20(15)14(12)16/h11H,3-10,16H2,1-2H3
45 atoms
N  -0.77027 -1.277306 0.749812
N  0.691035 -2.062742 -0.919011
N  -0.26375 0.182344 2.432187
N  -2.050356 -1.401892 1.130003
N  -1.638768 -2.634443 -0.721655
C  1.424033 2.516611 0.329242
C  2.706701 1.719518 0.590115
C  0.801048 2.245856 -1.040666
C  2.508427 0.385706 1.329638
C  -0.592288 2.844586 -1.215535
C  1.423928 -0.503668 0.783304
C  -1.678711 2.073101 -0.474967
C  1.626009 -1.33258 -0.354919
C  -3.069415 2.674972 -0.62692
C  0.164235 -0.509063 1.356904
C  2.995601 -1.407994 -0.979118
C  -0.518604 -2.024757 -0.372415
C  -4.134915 1.876082 0.11021
C  3.101403 -2.359179 -2.158365
C  -2.509762 -2.225347 0.206643
H  1.644213 3.585706 0.394728
H  0.697105 2.322218 1.122209
H  3.215919 1.542372 -0.361159
H  3.405065 2.314529 1.183843
H  1.472548 2.648628 -1.805127
H  0.749191 1.169956 -1.229852
H  2.314239 0.60769 2.383469
H  3.458343 -0.153404 1.342441
H  -0.588054 3.889773 -0.88609
H  -0.84146 2.867552 -2.280423
H  -1.436443 2.006448 0.590082
H  -1.69513 1.041629 -0.844059
H  -3.325283 2.735439 -1.689115
H  -3.062468 3.70612 -0.260189
H  3.715646 -1.697049 -0.20637
H  3.298828 -0.403729 -1.289144
H  -4.175414 0.847032 -0.249654
H  -3.926403 1.8330 1.180474
H  -5.125652 2.312898 -0.016847
H  4.121572 -2.360102 -2.542298
H  2.432676 -2.06996 -2.966364
H  2.842737 -3.377643 -1.875484
H  -1.174197 -0.044531 2.797558
H  0.400795 0.602366 3.052939
H  -3.542063 -2.540912 0.217297
totalener: -860.50759246 hartree
nucrepener: 1686.05814498 hartree
electener: -2546.56573744 hartree
oneelecener: -4514.09153267 hartree
twoeener: 1967.52579523 hartree
kineticenergy: 856.59399614 hartree
xcener: -85.958136995327 hartree
chargesum: -0.0000000
charge: 0.177188 -0.298777 -0.254215 -0.393243 -0.296451 -0.123298 -0.157000 -0.122668 -0.213180 -0.137786 -0.041183 -0.084156 0.137969 -0.096096 0.167743 -0.127646 0.193583 -0.240765 -0.239284 0.090307 0.083604 0.054740 0.080291 0.084264 0.082858 0.075208 0.077022 0.098699 0.054539 0.071426 0.037730 0.047177 0.055174 0.050461 0.078153 0.082743 0.071435 0.066571 0.086970 0.078911 0.087925 0.088368 0.175184 0.161617 0.127888
qa: 0.1772 -0.2988 -0.2542 -0.3932 -0.2965 -0.1233 -0.1570 -0.1227 -0.2132 -0.1378 -0.0412 -0.0842 0.1380 -0.0961 0.1677 -0.1276 0.1936 -0.2408 -0.2393 0.0903 0.0836 0.0547 0.0803 0.0843 0.0829 0.0752 0.0770 0.0987 0.0545 0.0714 0.0377 0.0472 0.0552 0.0505 0.0782 0.0827 0.0714 0.0666 0.0870 0.0789 0.0879 0.0884 0.1752 0.1616 0.1279
va: 3.3174 2.9737 3.2345 2.7524 3.0663 3.8073 3.8780 3.9047 3.9084 3.9547 3.5859 3.8915 3.8032 3.9036 4.1032 3.8908 4.3540 3.9453 3.9691 4.0586 1.0121 1.0199 1.0025 1.0136 1.0087 1.0111 1.0083 1.0154 1.0100 1.0113 1.0173 1.0129 1.0087 1.0078 1.0033 1.0028 1.0081 1.0066 1.0063 1.0026 1.0119 1.0118 1.0383 1.0292 1.0008
dispcorr: -0.024193547 hartree
energy: -860.531786002889
dipole: 4.59897 -3.53877 1.06020 22.36461 -21.02501 1.33960 -4.20915 5.72769 1.51855
magnitude: 2.28572 au
magnitude: 5.80985 debye
