program: Orca
programVersion: 5.0.2
elementType: N N N N N C C C C C C C C C C C C C C C H H H H H H H H H H H H H H H H H H H H H H H H H
charge: 0
multiplicity: 1
keywords: wb97x-d3
keywords: def2-TZVPP
keywords: def2/J RIJCOSX
keywords: DEFGRID2
keywords: scfconv7
keywords: smallprint printgap noloewdin
keywords: NOSOSCF
formula: C15H25N5
InChI: InChI=1/C15H25N5/c1-3-5-6-7-8-9-10-12-13(4-2)19-15-17-11-18-20(15)14(12)16/h11H,3-10,16H2,1-2H3
45 atoms
N  -0.452738 -2.423776 1.629055
N  -0.129497 -2.490709 -0.703787
N  0.320821 -0.806577 3.055906
N  -1.052906 -3.129296 2.598477
N  -1.338367 -4.123981 0.586605
C  1.339715 3.143147 0.692196
C  0.590361 1.817525 0.615998
C  0.476727 4.372391 0.38389
C  1.508903 0.601102 0.747448
C  0.526128 4.833896 -1.073665
C  0.768028 -0.702173 0.654443
C  0.0849 3.819747 -2.125384
C  0.542682 -1.368322 -0.578505
C  -1.38886 3.437216 -2.060383
C  0.226824 -1.266816 1.7949
C  1.106508 -0.78032 -1.847507
C  -0.627497 -3.023978 0.40577
C  -1.774083 2.411844 -3.117154
C  0.698304 -1.506838 -3.116891
C  -1.560502 -4.130544 1.905364
H  2.196902 3.118524 0.009683
H  1.77086 3.237143 1.69355
H  -0.178898 1.789862 1.395576
H  0.044256 1.738134 -0.325882
H  -0.556972 4.182117 0.689608
H  0.810234 5.209603 1.001631
H  2.07093 0.655848 1.686626
H  2.274744 0.650355 -0.029029
H  -0.08494 5.736285 -1.175749
H  1.551552 5.143933 -1.297684
H  0.705082 2.918329 -2.062362
H  0.291395 4.237853 -3.115496
H  -1.996981 4.338652 -2.183375
H  -1.638322 3.044889 -1.07063
H  2.198981 -0.765037 -1.767075
H  0.811983 0.27197 -1.916061
H  -2.835979 2.170246 -3.074886
H  -1.558958 2.778164 -4.12224
H  -1.222387 1.478377 -2.986357
H  1.025627 -2.544148 -3.107814
H  1.140935 -1.014963 -3.983172
H  -0.382951 -1.511356 -3.243446
H  -0.211358 -1.274323 3.770454
H  0.620417 0.133741 3.226365
H  -2.122081 -4.909989 2.397764
totalener: -860.50884831 hartree
nucrepener: 1603.05464158 hartree
electener: -2463.56348989 hartree
oneelecener: -4347.73548666 hartree
twoeener: 1884.17199678 hartree
kineticenergy: 856.59912736 hartree
xcener: -85.957639944037 hartree
chargesum: -0.0000000
charge: 0.146181 -0.307792 -0.270504 -0.399750 -0.307081 -0.101684 -0.142491 -0.147860 -0.191094 -0.146525 -0.107048 -0.118566 0.189599 -0.108145 0.240351 -0.111066 0.204083 -0.238784 -0.245095 0.097068 0.065268 0.075611 0.078021 0.048355 0.067126 0.082963 0.084352 0.091105 0.069785 0.072726 0.046548 0.081229 0.068582 0.058720 0.085116 0.036034 0.088782 0.076620 0.063263 0.096574 0.081253 0.085159 0.176841 0.159046 0.127122
qa: 0.1462 -0.3078 -0.2705 -0.3998 -0.3071 -0.1017 -0.1425 -0.1479 -0.1911 -0.1465 -0.1070 -0.1186 0.1896 -0.1081 0.2404 -0.1111 0.2041 -0.2388 -0.2451 0.0971 0.0653 0.0756 0.0780 0.0484 0.0671 0.0830 0.0844 0.0911 0.0698 0.0727 0.0465 0.0812 0.0686 0.0587 0.0851 0.0360 0.0888 0.0766 0.0633 0.0966 0.0813 0.0852 0.1768 0.1590 0.1271
va: 3.3421 3.0134 3.2728 2.7711 3.0663 3.8066 3.8104 3.8926 3.8536 3.9360 3.6377 3.8669 3.8129 3.8664 4.1126 3.9047 4.3625 3.9570 3.9602 4.0688 1.0126 1.0113 1.0195 1.0279 1.0041 1.0069 1.0136 1.0154 1.0124 1.0091 1.0072 1.0108 1.0071 1.0017 1.0063 1.0050 1.0076 1.0040 0.9999 1.0138 1.0019 1.0121 1.0390 1.0281 1.0000
dispcorr: -0.021040287 hartree
energy: -860.529888600153
dipole: 4.60064 -3.81774 0.78289 38.26792 -36.11247 2.15546 -18.33288 19.25013 0.91725
magnitude: 2.46987 au
magnitude: 6.27791 debye
