program: Orca
programVersion: 5.0.2
elementType: N N N N N C C C C C C C C C C C C C C C H H H H H H H H H H H H H H H H H H H H H H H H H
charge: 0
multiplicity: 1
keywords: wb97x-d3
keywords: def2-TZVPP
keywords: def2/J RIJCOSX
keywords: DEFGRID2
keywords: scfconv7
keywords: smallprint printgap noloewdin
keywords: NOSOSCF
formula: C15H25N5
InChI: InChI=1/C15H25N5/c1-3-5-6-7-8-9-10-12-13(4-2)19-15-17-11-18-20(15)14(12)16/h11H,3-10,16H2,1-2H3
45 atoms
N  -0.95324 -2.224953 0.26244
N  1.128678 -3.126229 -0.373129
N  -1.423403 -0.012568 0.614615
N  -2.203237 -2.630763 0.532484
N  -0.888766 -4.389321 -0.015418
C  1.724832 2.795253 -1.322457
C  1.227865 1.351766 -1.319735
C  1.03343 3.721067 -0.322197
C  1.396696 0.639145 0.023995
C  -0.482083 3.779158 -0.469254
C  0.833801 -0.75509 0.020001
C  -1.145986 4.71143 0.536855
C  1.597846 -1.896074 -0.329222
C  -2.669753 4.741776 0.448875
C  -0.507158 -0.950274 0.311115
C  3.065589 -1.767612 -0.632458
C  -0.152359 -3.291816 -0.069266
C  -3.337759 3.419304 0.807194
C  3.906793 -1.889171 0.637235
C  -2.091728 -3.932131 0.347041
H  1.600105 3.202178 -2.330011
H  2.801655 2.805689 -1.127194
H  0.178323 1.310864 -1.623136
H  1.768454 0.787127 -2.084055
H  1.285702 3.424307 0.701294
H  1.443553 4.728591 -0.438162
H  0.928438 1.226668 0.821313
H  2.453826 0.620398 0.29612
H  -0.740184 4.095851 -1.485793
H  -0.899718 2.773125 -0.366724
H  -0.757081 5.723967 0.393181
H  -0.850675 4.420977 1.551985
H  -2.969726 5.041037 -0.559764
H  -3.046054 5.520404 1.116911
H  3.285078 -0.826705 -1.140184
H  3.331225 -2.570328 -1.319757
H  -3.09307 2.627341 0.097586
H  -3.03736 3.084531 1.803032
H  -4.423453 3.514183 0.812479
H  3.730199 -2.849615 1.119923
H  3.66907 -1.106114 1.35863
H  4.969696 -1.818365 0.406529
H  -2.329274 -0.32167 0.92638
H  -1.135675 0.91767 0.85276
H  -2.943065 -4.580877 0.487936
totalener: -860.51137894 hartree
nucrepener: 1595.10659370 hartree
electener: -2455.61797264 hartree
oneelecener: -4331.51806316 hartree
twoeener: 1875.90009052 hartree
kineticenergy: 856.59366994 hartree
xcener: -85.955712092727 hartree
chargesum: -0.0000000
charge: 0.146747 -0.293985 -0.281150 -0.401337 -0.305660 -0.160040 -0.113854 -0.112690 -0.226294 -0.144610 -0.095678 -0.106403 0.172787 -0.089307 0.232664 -0.147709 0.217430 -0.286493 -0.260550 0.097740 0.077624 0.076693 0.084917 0.093311 0.064263 0.079850 0.082691 0.099813 0.077964 0.015372 0.072270 0.056868 0.054913 0.072522 0.067934 0.095898 0.069180 0.078069 0.098493 0.104056 0.071925 0.088059 0.175970 0.172745 0.126990
qa: 0.1467 -0.2940 -0.2811 -0.4013 -0.3057 -0.1600 -0.1139 -0.1127 -0.2263 -0.1446 -0.0957 -0.1064 0.1728 -0.0893 0.2327 -0.1477 0.2174 -0.2865 -0.2606 0.0977 0.0776 0.0767 0.0849 0.0933 0.0643 0.0799 0.0827 0.0998 0.0780 0.0154 0.0723 0.0569 0.0549 0.0725 0.0679 0.0959 0.0692 0.0781 0.0985 0.1041 0.0719 0.0881 0.1760 0.1727 0.1270
va: 3.3376 3.0504 3.2704 2.7682 3.0625 3.9088 3.7921 3.8436 3.8442 3.8742 3.5618 3.8722 3.8946 3.8843 4.1426 3.9012 4.3484 3.9310 3.9148 4.0688 1.0104 1.0114 1.0097 1.0188 1.0063 1.0136 1.0063 1.0111 1.0161 1.0169 1.0143 1.0127 1.0101 1.0082 1.0067 1.0250 1.0029 0.9988 1.0121 1.0071 1.0052 1.0058 1.0398 1.0209 1.0000
dispcorr: -0.020924349 hartree
energy: -860.532303288515
dipole: 5.10184 -5.01351 0.08832 39.36930 -36.76850 2.60080 0.38185 -0.03807 0.34378
magnitude: 2.62491 au
magnitude: 6.67200 debye
