program: Orca
programVersion: 5.0.2
elementType: N N N N N C C C C C C C C C C C C C C C H H H H H H H H H H H H H H H H H H H H H H H H H
charge: 0
multiplicity: 1
keywords: wb97x-d3
keywords: def2-TZVPP
keywords: def2/J RIJCOSX
keywords: DEFGRID2
keywords: scfconv7
keywords: smallprint printgap noloewdin
keywords: NOSOSCF
formula: C15H25N5
InChI: InChI=1/C15H25N5/c1-3-5-6-7-8-9-10-12-13(4-2)19-15-17-11-18-20(15)14(12)16/h11H,3-10,16H2,1-2H3
45 atoms
N  -0.117079 -2.590005 1.520026
N  0.489251 -2.715829 -0.751967
N  0.561354 -0.996194 3.015222
N  -0.866836 -3.248152 2.417024
N  -0.983154 -4.242204 0.387266
C  0.54178 1.903992 -0.32406
C  1.270859 1.572595 0.970806
C  -0.349875 3.132975 -0.200568
C  2.123719 0.298906 0.899043
C  -1.078231 3.479083 -1.492685
C  1.324317 -0.959072 0.690781
C  -1.99783 4.685757 -1.357559
C  1.218135 -1.636255 -0.550663
C  -2.726594 5.037686 -2.648073
C  0.616766 -1.482505 1.762352
C  2.005963 -1.180801 -1.749068
C  -0.183986 -3.192707 0.287194
C  -3.652532 6.235883 -2.497706
C  3.417891 -1.764298 -1.743618
C  -1.354808 -4.2212 1.671301
H  -0.06674 1.04895 -0.634446
H  1.272766 2.065437 -1.124174
H  1.918365 2.41093 1.245674
H  0.535683 1.482366 1.77678
H  -1.084264 2.966167 0.594902
H  0.250228 3.991567 0.119937
H  2.718766 0.212754 1.816268
H  2.86672 0.409382 0.108596
H  -0.345148 3.66631 -2.284741
H  -1.66169 2.613233 -1.823165
H  -1.416831 5.551789 -1.021899
H  -2.732783 4.494656 -0.567981
H  -3.301183 4.170809 -2.987687
H  -1.993171 5.238007 -3.434966
H  2.048535 -0.092436 -1.806741
H  1.476445 -1.525812 -2.636546
H  -4.157999 6.472508 -3.434189
H  -4.422397 6.049934 -1.747057
H  -3.101864 7.125556 -2.187624
H  3.380959 -2.852891 -1.726174
H  3.991353 -1.437057 -0.875194
H  3.964647 -1.460972 -2.636303
H  0.110942 -1.557198 3.719316
H  1.221317 -0.303225 3.312435
H  -2.021422 -4.956139 2.096742
totalener: -860.51355430 hartree
nucrepener: 1550.36632047 hartree
electener: -2410.87987477 hartree
oneelecener: -4242.44752552 hartree
twoeener: 1831.56765075 hartree
kineticenergy: 856.59934020 hartree
xcener: -85.953384165542 hartree
chargesum: -0.0000000
charge: 0.143298 -0.290358 -0.271461 -0.399717 -0.305846 -0.106845 -0.126671 -0.130034 -0.202341 -0.092994 -0.108847 -0.108175 0.171238 -0.079987 0.237876 -0.136732 0.216352 -0.257915 -0.262395 0.096181 0.076717 0.057737 0.077185 0.062166 0.058094 0.055835 0.095305 0.090149 0.052743 0.057733 0.051658 0.052387 0.053781 0.051736 0.070991 0.095389 0.085246 0.072279 0.071502 0.103368 0.073437 0.088637 0.173848 0.159940 0.127511
qa: 0.1433 -0.2904 -0.2715 -0.3997 -0.3058 -0.1068 -0.1267 -0.1300 -0.2023 -0.0930 -0.1088 -0.1082 0.1712 -0.0800 0.2379 -0.1367 0.2164 -0.2579 -0.2624 0.0962 0.0767 0.0577 0.0772 0.0622 0.0581 0.0558 0.0953 0.0901 0.0527 0.0577 0.0517 0.0524 0.0538 0.0517 0.0710 0.0954 0.0852 0.0723 0.0715 0.1034 0.0734 0.0886 0.1738 0.1599 0.1275
va: 3.3416 3.0454 3.2680 2.7686 3.0619 3.8591 3.8550 3.9330 3.8512 3.8814 3.5433 3.8889 3.8507 3.8911 4.1119 3.8718 4.3498 3.9541 3.9166 4.0713 1.0127 1.0086 1.0150 1.0193 1.0111 1.0119 1.0035 1.0141 1.0126 1.0136 1.0103 1.0108 1.0082 1.0078 1.0103 1.0281 1.0063 1.0033 1.0031 1.0064 1.0043 1.0057 1.0407 1.0284 1.0001
dispcorr: -0.018794945 hartree
energy: -860.532349246896
dipole: -0.58211 1.66365 1.08154 43.21810 -41.39100 1.82710 -15.15074 16.25051 1.09977
magnitude: 2.39114 au
magnitude: 6.07778 debye
