program: Orca
programVersion: 5.0.2
elementType: N N N N N C C C C C C C C C C C C C C C H H H H H H H H H H H H H H H H H H H H H H H H H
charge: 0
multiplicity: 1
keywords: wb97x-d3
keywords: def2-TZVPP
keywords: def2/J RIJCOSX
keywords: DEFGRID2
keywords: scfconv7
keywords: smallprint printgap noloewdin
keywords: NOSOSCF
formula: C15H25N5
InChI: InChI=1/C15H25N5/c1-3-5-6-7-8-9-10-12-13(4-2)19-15-17-11-18-20(15)14(12)16/h11H,3-10,16H2,1-2H3
45 atoms
N  -0.039696 -2.6290 1.647753
N  0.703427 -2.727997 -0.584186
N  0.484451 -1.005759 3.173013
N  -0.798007 -3.327764 2.505608
N  -0.723045 -4.344787 0.485856
C  0.493018 1.942394 -0.237273
C  1.12448 1.636709 1.113774
C  -0.424689 3.157805 -0.200531
C  2.034034 0.400274 1.118594
C  -1.018343 3.502814 -1.560147
C  1.31767 -0.90086 0.87653
C  -1.934481 4.719216 -1.525467
C  1.339286 -1.599068 -0.360037
C  -2.507969 5.080271 -2.88988
C  0.597349 -1.467181 1.915241
C  2.14869 -1.056761 -1.51148
C  0.007098 -3.243993 0.420994
C  -3.420022 6.297591 -2.848021
C  2.052681 -1.872997 -2.788713
C  -1.173609 -4.338024 1.74478
H  -0.071738 1.072528 -0.58711
H  1.284746 2.111396 -0.975533
H  1.711521 2.501001 1.439271
H  0.325556 1.521027 1.854788
H  -1.234194 2.979681 0.515571
H  0.129837 4.021731 0.181949
H  2.565621 0.349588 2.075683
H  2.820931 0.539805 0.376497
H  -0.207142 3.680298 -2.274535
H  -1.572523 2.640269 -1.945207
H  -1.383897 5.578035 -1.125836
H  -2.755433 4.537604 -0.823296
H  -3.058557 4.223574 -3.28978
H  -1.687043 5.261949 -3.590079
H  3.195807 -0.989356 -1.197194
H  1.842369 -0.026285 -1.70916
H  -2.889025 7.177863 -2.481746
H  -3.812511 6.538563 -3.836071
H  -4.272545 6.13188 -2.187453
H  2.660571 -1.412195 -3.567513
H  1.027179 -1.933459 -3.147965
H  2.401969 -2.892641 -2.64095
H  -0.142896 -1.480148 3.80053
H  0.784126 -0.078762 3.403732
H  -1.812666 -5.113747 2.138782
totalener: -860.51375226 hartree
nucrepener: 1546.23650661 hartree
electener: -2406.75025887 hartree
oneelecener: -4234.22221374 hartree
twoeener: 1827.47195487 hartree
kineticenergy: 856.59797083 hartree
xcener: -85.955736274812 hartree
chargesum: 0.0000000
charge: 0.144382 -0.306964 -0.273650 -0.397673 -0.307731 -0.103207 -0.136911 -0.135984 -0.189494 -0.090156 -0.131967 -0.108460 0.191106 -0.078903 0.250910 -0.130143 0.202043 -0.258651 -0.240941 0.095256 0.076178 0.056359 0.079392 0.053348 0.058092 0.055540 0.101574 0.090215 0.052184 0.058431 0.051129 0.053073 0.053825 0.051476 0.077651 0.089003 0.071749 0.085395 0.072622 0.078814 0.085907 0.089502 0.176743 0.161621 0.127315
qa: 0.1444 -0.3070 -0.2736 -0.3977 -0.3077 -0.1032 -0.1369 -0.1360 -0.1895 -0.0902 -0.1320 -0.1085 0.1911 -0.0789 0.2509 -0.1301 0.2020 -0.2587 -0.2409 0.0953 0.0762 0.0564 0.0794 0.0533 0.0581 0.0555 0.1016 0.0902 0.0522 0.0584 0.0511 0.0531 0.0538 0.0515 0.0777 0.0890 0.0717 0.0854 0.0726 0.0788 0.0859 0.0895 0.1767 0.1616 0.1273
va: 3.3410 3.0073 3.2799 2.7725 3.0659 3.8634 3.8585 3.9303 3.8259 3.8777 3.6102 3.8895 3.7836 3.8910 4.0984 3.8863 4.3652 3.9544 3.9692 4.0711 1.0092 1.0085 1.0144 1.0156 1.0107 1.0121 1.0063 1.0164 1.0129 1.0135 1.0105 1.0108 1.0081 1.0079 0.9999 0.9970 1.0030 1.0063 1.0032 1.0021 1.0118 1.0130 1.0395 1.0311 1.0001
dispcorr: -0.018413570 hartree
energy: -860.532165831337
dipole: -3.74395 4.35523 0.61129 44.13516 -42.04879 2.08637 -18.39612 19.43345 1.03733
magnitude: 2.40887 au
magnitude: 6.12287 debye
