program: Orca
programVersion: 5.0.2
elementType: N N N N N C C C C C C C C C C C C C C C H H H H H H H H H H H H H H H H H H H H H H H H H
charge: 0
multiplicity: 1
keywords: wb97x-d3
keywords: def2-TZVPP
keywords: def2/J RIJCOSX
keywords: DEFGRID2
keywords: scfconv7
keywords: smallprint printgap noloewdin
keywords: NOSOSCF
formula: C15H25N5
InChI: InChI=1/C15H25N5/c1-3-5-6-7-8-9-10-12-13(4-2)19-15-17-11-18-20(15)14(12)16/h11H,3-10,16H2,1-2H3
45 atoms
N  -0.106727 -2.610067 1.751071
N  -0.252631 -2.577498 -0.600264
N  0.773809 -0.959735 3.073878
N  -0.435359 -3.398333 2.784929
N  -1.058391 -4.34172 0.825179
C  1.089765 3.098902 0.801147
C  0.422901 1.727059 0.780953
C  0.108726 4.270455 0.677705
C  1.427256 0.582509 0.638612
C  -0.095071 4.777124 -0.749346
C  0.779489 -0.77258 0.6350
C  -0.607165 3.747402 -1.748947
C  0.358065 -1.414461 -0.559186
C  -0.84392 4.334629 -3.134776
C  0.512556 -1.410776 1.832865
C  0.616959 -0.746421 -1.886363
C  -0.482633 -3.181457 0.55978
C  -1.331162 3.301087 -4.139377
C  0.038776 -1.478687 -3.084693
C  -0.997189 -4.41471 2.159126
H  1.831095 3.159587 -0.004036
H  1.661942 3.191019 1.729097
H  -0.163022 1.593222 1.695573
H  -0.298916 1.664691 -0.036152
H  -0.856638 3.98653 1.110077
H  0.465444 5.108594 1.280917
H  2.177005 0.65044 1.436412
H  2.001414 0.724037 -0.278919
H  -0.791095 5.621487 -0.723293
H  0.852946 5.185285 -1.116626
H  -1.537451 3.302217 -1.378768
H  0.108805 2.92285 -1.838292
H  0.083207 4.789512 -3.496678
H  -1.570035 5.150021 -3.064439
H  1.699044 -0.63233 -2.013088
H  0.223894 0.274943 -1.853427
H  -2.275478 2.855133 -3.823464
H  -1.488581 3.74163 -5.123945
H  -0.610251 2.489537 -4.254719
H  -1.041601 -1.583388 -3.005446
H  0.452739 -2.480113 -3.180561
H  0.261802 -0.926743 -3.997982
H  0.654909 -1.599327 3.841884
H  1.385864 -0.176785 3.201334
H  -1.386474 -5.254097 2.715218
totalener: -860.51002716 hartree
nucrepener: 1576.25391067 hartree
electener: -2436.76393783 hartree
oneelecener: -4294.20493270 hartree
twoeener: 1857.44099488 hartree
kineticenergy: 856.59853437 hartree
xcener: -85.955130961906 hartree
chargesum: 0.0000000
charge: 0.145346 -0.307448 -0.273279 -0.398561 -0.307116 -0.115333 -0.169301 -0.141203 -0.187413 -0.127838 -0.111951 -0.093826 0.178793 -0.090578 0.244204 -0.095194 0.204009 -0.249164 -0.243370 0.095697 0.064065 0.076636 0.086281 0.087844 0.066786 0.082720 0.079767 0.090231 0.065637 0.060092 0.067269 0.029195 0.053327 0.055996 0.076299 0.052489 0.076305 0.087313 0.067354 0.086732 0.092249 0.077617 0.175032 0.159090 0.127198
qa: 0.1453 -0.3074 -0.2733 -0.3986 -0.3071 -0.1153 -0.1693 -0.1412 -0.1874 -0.1278 -0.1120 -0.0938 0.1788 -0.0906 0.2442 -0.0952 0.2040 -0.2492 -0.2434 0.0957 0.0641 0.0766 0.0863 0.0878 0.0668 0.0827 0.0798 0.0902 0.0656 0.0601 0.0673 0.0292 0.0533 0.0560 0.0763 0.0525 0.0763 0.0873 0.0674 0.0867 0.0922 0.0776 0.1750 0.1591 0.1272
va: 3.3426 3.0135 3.2545 2.7715 3.0666 3.8153 3.8061 3.9078 3.8412 3.9176 3.6413 3.8656 3.8372 3.8998 4.1091 3.9034 4.3622 3.9480 3.9705 4.0703 1.0105 1.0096 1.0234 1.0067 1.0102 1.0065 1.0122 1.0177 1.0146 1.0096 1.0030 1.0147 1.0074 1.0092 1.0027 1.0028 1.0030 1.0070 1.0042 1.0115 1.0133 1.0026 1.0387 1.0296 1.0000
dispcorr: -0.019670712 hartree
energy: -860.529697868614
dipole: 1.83025 -0.72420 1.10605 41.08147 -39.03892 2.04255 -20.82430 21.64628 0.82197
magnitude: 2.46394 au
magnitude: 6.26285 debye
