program: Orca
programVersion: 5.0.2
elementType: N N N N N C C C C C C C C C C C C C C C H H H H H H H H H H H H H H H H H H H H H H H H H
charge: 0
multiplicity: 1
keywords: wb97x-d3
keywords: def2-TZVPP
keywords: def2/J RIJCOSX
keywords: DEFGRID2
keywords: scfconv7
keywords: smallprint printgap noloewdin
keywords: NOSOSCF
formula: C15H25N5
InChI: InChI=1/C15H25N5/c1-3-5-6-7-8-9-10-12-13(4-2)19-15-17-11-18-20(15)14(12)16/h11H,3-10,16H2,1-2H3
45 atoms
N  -0.335627 -2.654027 1.33266
N  1.170579 -3.160672 -0.406577
N  -0.568245 -0.624647 2.369696
N  -1.300243 -3.243428 2.053784
N  -0.426966 -4.687564 0.546912
C  1.221572 2.846781 -0.058885
C  0.740167 1.404337 -0.148837
C  0.462146 3.816037 -0.958988
C  1.597339 0.444957 0.680052
C  -1.009845 3.990005 -0.603033
C  1.110262 -0.974861 0.626387
C  -1.710867 5.018054 -1.481728
C  1.609853 -1.926289 -0.301046
C  -3.184563 5.202804 -1.143945
C  0.082977 -1.375085 1.461973
C  2.723194 -1.530287 -1.238042
C  0.196306 -3.528959 0.416929
C  -3.8685 6.235925 -2.027384
C  3.102563 -2.595004 -2.252212
C  -1.300771 -4.455135 1.532253
H  2.284432 2.88161 -0.318764
H  1.157745 3.189119 0.980384
H  -0.301769 1.327335 0.173652
H  0.750413 1.07827 -1.19372
H  0.953107 4.793093 -0.917047
H  0.547353 3.484117 -1.999311
H  1.637817 0.79738 1.718191
H  2.63288 0.500504 0.340349
H  -1.534537 3.033224 -0.686504
H  -1.096096 4.290438 0.447509
H  -1.615057 4.721774 -2.532078
H  -1.196056 5.981317 -1.395715
H  -3.282469 5.496546 -0.094359
H  -3.700529 4.242306 -1.235891
H  3.601088 -1.263651 -0.639426
H  2.441623 -0.608872 -1.757332
H  -3.400206 7.216307 -1.925027
H  -3.81193 5.955985 -3.080612
H  -4.922812 6.347399 -1.773727
H  2.260091 -2.857893 -2.889278
H  3.43546 -3.509766 -1.766598
H  3.910074 -2.230891 -2.887477
H  -1.196858 -1.091048 3.002608
H  -0.195625 0.264369 2.642787
H  -1.980832 -5.209913 1.897566
totalener: -860.51378030 hartree
nucrepener: 1530.01000889 hartree
electener: -2390.52378919 hartree
oneelecener: -4201.69770248 hartree
twoeener: 1811.17391328 hartree
kineticenergy: 856.60293542 hartree
xcener: -85.954907945558 hartree
chargesum: 0.0000000
charge: 0.145543 -0.307599 -0.272435 -0.398459 -0.306965 -0.131830 -0.123534 -0.119593 -0.203147 -0.104489 -0.099604 -0.116028 0.187283 -0.074763 0.237931 -0.130206 0.203386 -0.257714 -0.238481 0.096135 0.075513 0.058665 0.076369 0.075086 0.071213 0.062306 0.080784 0.092497 0.057650 0.053326 0.055024 0.053149 0.050500 0.052887 0.077429 0.076193 0.072303 0.073356 0.084853 0.085676 0.089832 0.078754 0.174351 0.159890 0.126965
qa: 0.1455 -0.3076 -0.2724 -0.3985 -0.3070 -0.1318 -0.1235 -0.1196 -0.2031 -0.1045 -0.0996 -0.1160 0.1873 -0.0748 0.2379 -0.1302 0.2034 -0.2577 -0.2385 0.0961 0.0755 0.0587 0.0764 0.0751 0.0712 0.0623 0.0808 0.0925 0.0577 0.0533 0.0550 0.0531 0.0505 0.0529 0.0774 0.0762 0.0723 0.0734 0.0849 0.0857 0.0898 0.0788 0.1744 0.1599 0.1270
va: 3.3442 3.0108 3.2552 2.7715 3.0663 3.8767 3.7837 3.9051 3.8564 3.8697 3.6328 3.9046 3.8163 3.8862 4.1112 3.8980 4.3627 3.9556 3.9651 4.0704 1.0147 1.0122 1.0206 1.0163 1.0132 1.0113 1.0088 1.0154 1.0133 1.0108 1.0097 1.0112 1.0077 1.0082 1.0017 0.9978 1.0031 1.0031 1.0064 1.0117 1.0128 1.0021 1.0394 1.0284 1.0002
dispcorr: -0.017881096 hartree
energy: -860.531661397120
dipole: -2.31346 2.55279 0.23933 45.82049 -43.51583 2.30466 -14.92243 15.71321 0.79078
magnitude: 2.44828 au
magnitude: 6.22304 debye
