program: Gaussian 09
title: 000069321
version: EM64L-G09RevD.01
frameworkgroup: C1[X(C7H7NO2)]
method: RPBEPBE
basis: SDD
operation: Freq
keyword: #pfreq=noraman
keyword: PBEPBE/SDD
title: #p freq=noraman PBEPBE/SDD
converged: NO NO NO NO
title: Mulliken charges:
elementType: O O N C C C C C C C H H H H H H H
charge: -0.195781 -0.195765 0.156733 0.435032 -0.536604 -0.344336 -0.343664 -0.218637 -0.218640 -0.225624 0.248389 0.248578 0.244670 0.244874 0.233021 0.233014 0.234738
chargesum: 0.00000
title: Mulliken charges with hydrogens summed into heavy atoms:
elementType: O O N C C C C C C C
charge: -0.195781 -0.195765 0.156733 0.435032 -0.039636 -0.099665 -0.098790 0.014385 0.014374 0.009115
polarizability: 1.07386380e+02 1.71617397e-01 9.79267725e+01 -1.03192620e+01 3.72726203e-02 4.93906141e+01
1716.lowfreq: -12.7121 -5.0180 -0.0006 0.0007 0.0009 9.9867 20.6267 43.0108 92.9183
frequency: -6.2559 42.9387 92.9182 236.4388 293.7240 401.1956 443.5339 464.8120 499.7007 595.2359 616.3884 685.9725 704.1143 761.7572 821.3842 839.1890 852.0249 934.4539 958.4462 980.1706 990.0142 1002.3509 1025.8322 1089.7617 1162.0028 1176.1603 1190.1978 1200.6940 1225.1715 1316.9930 1329.0613 1384.8731 1428.6138 1444.8972 1459.2159 1484.3171 1596.3230 1612.0825 3052.0068 3127.0368 3127.7333 3130.4531 3140.6673 3153.3068 3168.2069
redmass: 4.7347 9.8885 6.7305 5.1069 4.0315 2.7713 2.3924 4.0663 5.9393 6.2368 6.2291 5.5429 1.6459 2.5200 6.0866 3.7496 1.2499 1.5272 1.7520 1.3962 6.1394 1.3331 2.2359 1.5522 1.2005 1.0544 1.1147 4.5950 3.2638 1.4591 1.2759 9.5677 5.1891 2.2367 1.1163 2.2156 6.1034 6.0667 1.0574 1.0856 1.1040 1.0933 1.0924 1.0966 1.1017
irintensity: 1.3738 0.1495 3.5374 2.1236 0.5026 0.0023 0.1487 2.0175 11.3144 28.1656 0.0310 3.8889 82.5214 14.8232 6.0081 13.1179 0.1115 2.0850 2.2511 0.1617 0.4982 0.0310 4.8860 4.2173 31.1218 0.5183 0.2593 38.8575 58.8483 16.8434 0.1594 9.0719 95.7849 37.8472 23.0194 7.0170 0.6941 0.3284 13.1268 2.2785 0.5336 0.5850 12.3985 28.5579 15.3880
temp: 298.150 k
press: 1.00000 atm
elementType: 8 8 7 6 6 6 6 6 6 6 1 1 1 1 1 1 1
symmnumber: 1
zpe: 336404.1 jmol-1
zpe.correction: 0.128130 hartree
zpe.thermalcorrener: 0.135796 hartree
zpe.thermalcorrenthalpy: 0.136740 hartree
zpe.thermalcorrgfe: 0.094568 hartree
zpe.sumelectzpe: -475.332803 hartree
zpe.sumelectthermal: -475.325136 hartree
zpe.sumelectthermalent: -475.324192 hartree
zpe.sumelectthermalfe: -475.366364 hartree
dipole: 3.2975 -0.0104 2.5046
dipole: 4.1408
quadrupole: -60.7776 -54.8990 -59.1975
quadrupole: -0.0057 -9.3286 0.0439
quadrupole: -2.4863 3.3924 -0.9061 -0.0057 -9.3286 0.0439
hfenergy: -475.4609322 hartree
pointgroup: C01 [X(C7H7N1O2)]
dipole: -1.309664 0.004976 0.968918 debye
dipolederiv: -0.4181624 -0.1509947 0.1337828 -0.1033056 -0.7014425 -0.0032387 0.2945435 0.1456688 -0.3501398 -0.4142733 0.143993 0.1350227 0.0933082 -0.7038955 -0.0016167 0.2911617 -0.1503132 -0.3515751 0.5085619 0.0076386 -0.4530277 0.0098805 1.1756888 0.0055389 -0.7476212 0.0055541 0.5312158 0.1977067 -0.0002654 -0.002999 0.0009251 -0.0038179 -0.0009973 0.0629856 -0.0007376 -0.171669 0.1634535 -0.0003441 0.1989646 -0.0010981 0.1346729 -0.0001257 0.0918078 -0.0005437 0.1712271 -0.0706264 0.0932077 0.0497544 0.0186346 0.0209265 0.0150218 0.0173834 0.0185164 -0.1156752 -0.0696633 -0.0930483 0.0496288 -0.0194252 0.020933 -0.0158287 0.016289 -0.0186654 -0.1154046 -0.0575946 -0.1130414 0.0326781 -0.1012111 0.0795209 -0.0325293 0.0286924 -0.0469166 -0.1222699 -0.0580183 0.113547 0.032391 0.1021716 0.0797909 0.0313374 0.0285416 0.0460283 -0.1225811 0.0776001 0.0001818 0.0973191 -0.0003448 -0.0354248 -0.0001852 0.0903722 -0.0002977 -0.1104474 0.0211208 -0.0214359 -0.0063188 -0.0771794 -0.0006546 -0.0957003 0.0386495 -0.01768 0.0436704 0.0219463 0.0214434 -0.0066603 0.0784061 -0.0003893 0.0960859 0.0375087 0.017685 0.043026 0.0518561 -0.0904799 -0.0460891 -0.0736735 -0.018232 -0.0252097 -0.0308101 -0.0276445 0.1291928 0.0524491 0.0900357 -0.0464417 0.0734018 -0.0178216 0.0261039 -0.0310738 0.0280745 0.1288304 0.0409121 0.0769718 -0.0393158 0.0881455 -0.0605593 0.0304387 -0.0503446 0.0286196 0.1435047 0.040703 -0.0773092 -0.0389139 -0.088556 -0.0605795 -0.0292687 -0.0500757 -0.0275042 0.143804 -0.0879713 -0.0001003 -0.0897751 -0.0000797 0.091284 0.0001737 -0.0880098 0.0001563 0.1252909 unknown
polarizability: 107.1167052|0.1670503|97.9265514|11.0483473|-0.0456515|49.6605102 unknown
InChI: InChI=1S/C7H7NO2/c9-8(10)6-7-4-2-1-3-5-7/h1-5H,6H2
charge 0 multiplicity 1
17 atoms
O  2.681737 1.136156 -0.551551
O  2.659927 -1.148494 -0.557226
N  2.295207 -0.00368 -0.09884
C  -0.133646 0.002006 0.536594
C  1.289247 0.00258 1.064737
C  -0.797476 1.227194 0.277268
C  -0.799402 -1.223437 0.283687
C  -2.117462 1.226289 -0.224841
C  -2.119421 -1.223013 -0.218319
C  -2.780576 0.001503 -0.472851
H  1.515519 0.911041 1.644349
H  1.513209 -0.901816 1.651701
H  -0.280906 2.17651 0.462339
H  -0.28412 -2.172501 0.473368
H  -2.626011 2.176282 -0.422157
H  -2.629502 -2.173211 -0.410631
H  -3.804824 0.001291 -0.862126
