program: Orca
programVersion: 5.0.2
elementType: N N N N N C C C C C C C C C C C C C C C H H H H H H H H H H H H H H H H H H H H H H H H H
charge: 0
multiplicity: 1
keywords: wb97x-d3
keywords: def2-TZVPP
keywords: def2/J RIJCOSX
keywords: DEFGRID2
keywords: scfconv7
keywords: smallprint printgap noloewdin
keywords: NOSOSCF
formula: C15H25N5
InChI: InChI=1/C15H25N5/c1-3-5-6-7-8-9-10-12-13(4-2)19-15-17-11-18-20(15)14(12)16/h11H,3-10,16H2,1-2H3
45 atoms
N  -0.446225 -2.695418 1.31938
N  1.189882 -3.177256 -0.302135
N  -0.755984 -0.691695 2.377316
N  -1.465146 -3.29514 1.954476
N  -0.450216 -4.730319 0.528731
C  1.284302 2.833274 0.058927
C  0.827548 1.390974 -0.118937
C  0.730535 3.795092 -0.987506
C  1.500482 0.429278 0.862216
C  -0.785944 3.950767 -0.960056
C  1.026195 -0.991156 0.725586
C  -1.284416 4.995128 -1.952562
C  1.596292 -1.929602 -0.170328
C  -2.803549 5.12548 -2.019403
C  -0.058077 -1.412622 1.482151
C  2.713382 -1.548916 -1.104815
C  0.168725 -3.563586 0.449199
C  -3.438186 5.641873 -0.735012
C  2.214781 -1.432493 -2.544007
C  -1.406873 -4.506723 1.435413
H  2.377953 2.864447 0.024799
H  1.007168 3.185477 1.059129
H  -0.258947 1.317541 -0.010014
H  1.042049 1.063643 -1.140912
H  1.190047 4.77729 -0.840696
H  1.043793 3.46421 -1.983614
H  1.340912 0.778972 1.888351
H  2.582801 0.480316 0.732511
H  -1.266904 2.993105 -1.184514
H  -1.097811 4.217141 0.055209
H  -0.906258 4.742575 -2.94813
H  -0.84799 5.968958 -1.70446
H  -3.238892 4.155751 -2.279545
H  -3.063194 5.799096 -2.840035
H  3.471461 -2.33197 -1.052657
H  3.195786 -0.619558 -0.804883
H  -4.513226 5.778652 -0.853356
H  -3.290762 4.956496 0.100198
H  -3.014907 6.606077 -0.447471
H  3.036641 -1.194906 -3.219246
H  1.463348 -0.648659 -2.645557
H  1.766614 -2.370208 -2.868231
H  -1.574655 -1.110173 2.786529
H  -0.667776 0.305428 2.402809
H  -2.109014 -5.26774 1.740864
totalener: -860.51129506 hartree
nucrepener: 1546.23769139 hartree
electener: -2406.74898645 hartree
oneelecener: -4233.98864413 hartree
twoeener: 1827.23965767 hartree
kineticenergy: 856.59867899 hartree
xcener: -85.954400058312 hartree
chargesum: -0.0000000
charge: 0.143960 -0.310302 -0.269084 -0.401983 -0.307819 -0.130514 -0.135356 -0.125008 -0.203853 -0.122801 -0.062216 -0.118996 0.169386 -0.104206 0.231103 -0.163160 0.215999 -0.256441 -0.252696 0.098136 0.074836 0.059799 0.070343 0.083271 0.073031 0.063624 0.082027 0.102370 0.061734 0.057196 0.067381 0.061200 0.052024 0.069281 0.092143 0.072761 0.087775 0.070678 0.075761 0.086368 0.070478 0.108252 0.177179 0.159579 0.126758
qa: 0.1440 -0.3103 -0.2691 -0.4020 -0.3078 -0.1305 -0.1354 -0.1250 -0.2039 -0.1228 -0.0622 -0.1190 0.1694 -0.1042 0.2311 -0.1632 0.2160 -0.2564 -0.2527 0.0981 0.0748 0.0598 0.0703 0.0833 0.0730 0.0636 0.0820 0.1024 0.0617 0.0572 0.0674 0.0612 0.0520 0.0693 0.0921 0.0728 0.0878 0.0707 0.0758 0.0864 0.0705 0.1083 0.1772 0.1596 0.1268
va: 3.3422 3.0401 3.2767 2.7680 3.0618 3.8784 3.8029 3.9037 3.8183 3.8571 3.5480 3.9038 3.8767 3.9022 4.1221 3.9078 4.3526 3.9321 3.9119 4.0711 1.0146 1.0135 1.0137 1.0197 1.0129 1.0124 1.0136 1.0114 1.0081 1.0078 1.0119 1.0106 1.0109 1.0085 1.0208 1.0113 1.0069 1.0017 1.0027 1.0055 1.0066 1.0142 1.0394 1.0280 1.0001
dispcorr: -0.018741688 hartree
energy: -860.530036744456
dipole: -2.03587 1.97683 -0.05904 46.79591 -44.34951 2.44639 -14.93753 15.44676 0.50923
magnitude: 2.49953 au
magnitude: 6.35330 debye
