program: Orca
programVersion: 5.0.2
elementType: N N N N N C C C C C C C C C C C C C C C H H H H H H H H H H H H H H H H H H H H H H H H H
charge: 0
multiplicity: 1
keywords: wb97x-d3
keywords: def2-TZVPP
keywords: def2/J RIJCOSX
keywords: DEFGRID2
keywords: scfconv7
keywords: smallprint printgap noloewdin
keywords: NOSOSCF
formula: C15H25N5
InChI: InChI=1/C15H25N5/c1-3-5-6-7-8-9-10-12-13(4-2)19-15-17-11-18-20(15)14(12)16/h11H,3-10,16H2,1-2H3
45 atoms
N  -0.569872 -2.107463 1.101873
N  0.934782 -2.806891 -0.565031
N  -0.322366 -0.309265 2.490621
N  -1.755207 -2.459945 1.623334
N  -1.141425 -3.893098 -0.016928
C  0.786566 2.134498 0.158132
C  2.173336 1.511061 0.239763
C  0.73206 3.318472 -0.800855
C  2.266875 0.298954 1.171438
C  -0.635698 3.988306 -0.898269
C  1.369143 -0.851905 0.798798
C  -1.729602 3.083587 -1.458907
C  1.686656 -1.778064 -0.227367
C  -3.03624 3.809622 -1.766605
C  0.173755 -1.043982 1.476985
C  2.931262 -1.634847 -1.062522
C  -0.197235 -2.974281 0.102634
C  -3.712664 4.413592 -0.54284
C  2.594859 -1.201263 -2.488222
C  -2.035187 -3.533652 0.910046
H  0.471986 2.471931 1.154391
H  0.066427 1.372991 -0.153391
H  2.489562 1.218479 -0.765565
H  2.893846 2.264002 0.573426
H  1.472704 4.061783 -0.490539
H  1.04082 2.985316 -1.797569
H  2.061126 0.617235 2.198177
H  3.302796 -0.043784 1.206175
H  -0.924128 4.362052 0.089273
H  -0.546329 4.872174 -1.537948
H  -1.934036 2.264165 -0.762557
H  -1.362051 2.611645 -2.376145
H  -3.724087 3.107541 -2.244777
H  -2.847797 4.595194 -2.504923
H  3.422278 -2.609118 -1.093396
H  3.641504 -0.937206 -0.620061
H  -3.904996 3.652457 0.216331
H  -3.104161 5.192027 -0.081385
H  -4.670473 4.864531 -0.802804
H  2.103608 -0.227265 -2.506742
H  1.92628 -1.921514 -2.956387
H  3.498544 -1.129971 -3.093052
H  -1.256918 -0.521576 2.79997
H  0.018404 0.620604 2.64178
H  -2.949785 -4.081532 1.080747
totalener: -860.51076607 hartree
nucrepener: 1597.93552224 hartree
electener: -2458.44628830 hartree
oneelecener: -4337.43523172 hartree
twoeener: 1878.98894342 hartree
kineticenergy: 856.59397110 hartree
xcener: -85.955032092886 hartree
chargesum: -0.0000000
charge: 0.149841 -0.311360 -0.269826 -0.399415 -0.306734 -0.145163 -0.124107 -0.145528 -0.208107 -0.124743 -0.093833 -0.116121 0.180911 -0.115389 0.236406 -0.155533 0.211673 -0.256008 -0.251389 0.097480 0.050709 0.091498 0.077673 0.080470 0.071061 0.066259 0.086266 0.105571 0.058626 0.075085 0.057992 0.073205 0.069852 0.053867 0.091216 0.072789 0.074010 0.073904 0.088042 0.065259 0.108754 0.087207 0.176582 0.163947 0.127102
qa: 0.1498 -0.3114 -0.2698 -0.3994 -0.3067 -0.1452 -0.1241 -0.1455 -0.2081 -0.1247 -0.0938 -0.1161 0.1809 -0.1154 0.2364 -0.1555 0.2117 -0.2560 -0.2514 0.0975 0.0507 0.0915 0.0777 0.0805 0.0711 0.0663 0.0863 0.1056 0.0586 0.0751 0.0580 0.0732 0.0699 0.0539 0.0912 0.0728 0.0740 0.0739 0.0880 0.0653 0.1088 0.0872 0.1766 0.1639 0.1271
va: 3.3301 3.0430 3.2681 2.7696 3.0620 3.8513 3.8277 3.9656 3.8503 3.8698 3.5358 3.8727 3.8494 3.9144 4.0651 3.8956 4.3596 3.9315 3.9143 4.0708 1.0105 0.9987 1.0080 1.0185 1.0121 1.0108 1.0142 1.0083 1.0091 1.0115 1.0106 1.0117 1.0081 1.0099 1.0213 1.0126 1.0023 1.0013 1.0076 1.0070 1.0149 1.0055 1.0400 1.0328 1.0000
dispcorr: -0.020135221 hartree
energy: -860.530901286749
dipole: 0.95382 -0.38112 0.57270 37.79341 -35.63376 2.15965 -11.09442 11.91207 0.81765
magnitude: 2.37920 au
magnitude: 6.04746 debye
