program: Orca
programVersion: 5.0.2
elementType: N N N N N C C C C C C C C C C C C C C C H H H H H H H H H H H H H H H H H H H H H H H H H
charge: 0
multiplicity: 1
keywords: wb97x-d3
keywords: def2-TZVPP
keywords: def2/J RIJCOSX
keywords: DEFGRID2
keywords: scfconv7
keywords: smallprint printgap noloewdin
keywords: NOSOSCF
formula: C15H25N5
InChI: InChI=1/C15H25N5/c1-3-5-6-7-8-9-10-12-13(4-2)19-15-17-11-18-20(15)14(12)16/h11H,3-10,16H2,1-2H3
45 atoms
N  -0.816041 -2.85193 0.499264
N  1.509195 -3.164624 0.699538
N  -1.883061 -0.860057 0.132485
N  -1.951748 -3.565017 0.538611
N  -0.150462 -4.904337 0.827963
C  0.59158 2.385067 -1.672747
C  0.493142 0.885965 -1.410548
C  -0.546742 3.202836 -1.071711
C  0.702905 0.498678 0.057928
C  -0.465582 4.680254 -1.436879
C  0.551981 -0.975367 0.313629
C  -1.658514 5.50767 -0.9651
C  1.63661 -1.863662 0.527431
C  -1.886238 5.526387 0.545017
C  -0.724561 -1.517806 0.315366
C  3.057272 -1.366613 0.559198
C  0.279377 -3.661642 0.678617
C  -0.714919 6.089179 1.338039
C  3.656653 -1.209402 -0.836781
C  -1.478277 -4.781046 0.735212
H  0.607909 2.549041 -2.754185
H  1.549991 2.762151 -1.299315
H  -0.475465 0.519762 -1.764783
H  1.238034 0.36242 -2.014057
H  -1.504151 2.797496 -1.42158
H  -0.549338 3.097024 0.017517
H  0.009531 1.057477 0.697765
H  1.691888 0.836338 0.370203
H  0.464615 5.100239 -1.041973
H  -0.389513 4.771572 -2.52469
H  -2.563328 5.134585 -1.45523
H  -1.531302 6.536816 -1.314773
H  -2.120117 4.519468 0.902368
H  -2.777967 6.123631 0.751642
H  3.637147 -2.100837 1.11693
H  3.130712 -0.423847 1.10505
H  -0.45499 7.093268 0.998295
H  -0.951826 6.153641 2.400067
H  0.179035 5.471309 1.243749
H  3.146359 -0.44346 -1.420249
H  3.594924 -2.146777 -1.388551
H  4.707552 -0.927373 -0.773373
H  -2.742016 -1.360659 0.288605
H  -1.902628 0.141497 0.168744
H  -2.148406 -5.623326 0.817112
totalener: -860.51026347 hartree
nucrepener: 1556.10736438 hartree
electener: -2416.61762785 hartree
oneelecener: -4253.60721348 hartree
twoeener: 1836.98958563 hartree
kineticenergy: 856.59842080 hartree
xcener: -85.955947443009 hartree
chargesum: 0.0000000
charge: 0.146102 -0.288019 -0.272947 -0.400831 -0.305726 -0.121127 -0.146540 -0.109493 -0.224815 -0.144007 -0.114512 -0.139289 0.196122 -0.121373 0.233283 -0.156678 0.219499 -0.251667 -0.275014 0.097623 0.074102 0.064249 0.081646 0.100470 0.060197 0.048445 0.092303 0.094336 0.069723 0.074407 0.067963 0.077116 0.054570 0.073856 0.097743 0.076852 0.080282 0.088885 0.069381 0.077412 0.103323 0.090308 0.173048 0.161636 0.127160
qa: 0.1461 -0.2880 -0.2729 -0.4008 -0.3057 -0.1211 -0.1465 -0.1095 -0.2248 -0.1440 -0.1145 -0.1393 0.1961 -0.1214 0.2333 -0.1567 0.2195 -0.2517 -0.2750 0.0976 0.0741 0.0642 0.0816 0.1005 0.0602 0.0484 0.0923 0.0943 0.0697 0.0744 0.0680 0.0771 0.0546 0.0739 0.0977 0.0769 0.0803 0.0889 0.0694 0.0774 0.1033 0.0903 0.1730 0.1616 0.1272
va: 3.3427 3.0538 3.2665 2.7680 3.0622 3.8586 3.8055 3.8406 3.8023 3.9060 3.6015 3.8941 3.8592 3.8873 4.1153 3.8663 4.3429 3.9339 3.9144 4.0704 1.0146 1.0105 1.0249 1.0176 1.0101 1.0100 1.0049 1.0172 1.0035 1.0141 1.0120 1.0095 1.0030 1.0091 1.0266 1.0077 1.0035 1.0074 1.0008 1.0061 1.0051 1.0069 1.0412 1.0267 1.0001
dispcorr: -0.019587250 hartree
energy: -860.529850720686
dipole: 3.61293 -4.22890 -0.61598 48.83676 -46.35181 2.48495 -7.89685 7.54663 -0.35022
magnitude: 2.58400 au
magnitude: 6.56800 debye
