program: Orca
programVersion: 5.0.2
elementType: N N N N N C C C C C C C C C C C C C C C H H H H H H H H H H H H H H H H H H H H H H H H H
charge: 0
multiplicity: 1
keywords: wb97x-d3
keywords: def2-TZVPP
keywords: def2/J RIJCOSX
keywords: DEFGRID2
keywords: scfconv7
keywords: smallprint printgap noloewdin
keywords: NOSOSCF
formula: C15H25N5
InChI: InChI=1/C15H25N5/c1-3-5-6-7-8-9-10-12-13(4-2)19-15-17-11-18-20(15)14(12)16/h11H,3-10,16H2,1-2H3
45 atoms
N  -0.630103 -2.531293 0.956526
N  1.029939 -3.151318 -0.596041
N  -0.864489 -0.477006 1.940603
N  -1.697799 -3.056905 1.576002
N  -0.718532 -4.586666 0.226386
C  1.29628 2.867316 -0.420614
C  0.776463 1.43997 -0.52471
C  0.687242 3.821448 -1.445284
C  1.478651 0.475582 0.43398
C  -0.832105 3.969568 -1.387787
C  0.941483 -0.925768 0.352718
C  -1.356198 4.480741 -0.050615
C  1.493183 -1.92222 -0.489112
C  -2.867457 4.69762 -0.015231
C  -0.182344 -1.26401 1.08976
C  2.72216 -1.638401 -1.30922
C  -0.035144 -3.457908 0.133103
C  -3.360243 5.803258 -0.939697
C  3.996155 -1.96393 -0.531126
C  -1.68943 -4.285031 1.094355
H  2.382502 2.861461 -0.554781
H  1.129606 3.245361 0.59326
H  -0.302395 1.415333 -0.33891
H  0.901289 1.075875 -1.549437
H  1.143359 4.808143 -1.319907
H  0.969377 3.48647 -2.448061
H  1.396461 0.85045 1.460826
H  2.550952 0.481397 0.231572
H  -1.132613 4.653713 -2.185361
H  -1.314777 3.015701 -1.624587
H  -0.84966 5.418857 0.203371
H  -1.087807 3.774828 0.741934
H  -3.164044 4.934994 1.009752
H  -3.373708 3.759946 -0.264915
H  2.742206 -0.601688 -1.650493
H  2.674194 -2.265046 -2.199477
H  -3.191777 5.56791 -1.990558
H  -4.430043 5.971614 -0.815818
H  -2.853469 6.746832 -0.72886
H  3.995283 -3.008283 -0.221815
H  4.091493 -1.351489 0.366574
H  4.880607 -1.794949 -1.145113
H  -1.718253 -0.833906 2.336024
H  -0.71817 0.513803 1.939904
H  -2.439385 -4.998911 1.399908
totalener: -860.51135047 hartree
nucrepener: 1560.15172979 hartree
electener: -2420.66308026 hartree
oneelecener: -4261.73327663 hartree
twoeener: 1841.07019636 hartree
kineticenergy: 856.59706697 hartree
xcener: -85.955123692661 hartree
chargesum: 0.0000000
charge: 0.145817 -0.295395 -0.269758 -0.401412 -0.306153 -0.122154 -0.156705 -0.161236 -0.183471 -0.134662 -0.083130 -0.123956 0.170731 -0.107647 0.223580 -0.145030 0.216099 -0.254915 -0.261392 0.097956 0.081525 0.065462 0.065174 0.085210 0.076378 0.075862 0.088511 0.090417 0.082242 0.069324 0.068415 0.055012 0.068045 0.053083 0.065649 0.095983 0.074645 0.087154 0.075879 0.104326 0.073536 0.087737 0.176995 0.159507 0.126761
qa: 0.1458 -0.2954 -0.2698 -0.4014 -0.3062 -0.1222 -0.1567 -0.1612 -0.1835 -0.1347 -0.0831 -0.1240 0.1707 -0.1076 0.2236 -0.1450 0.2161 -0.2549 -0.2614 0.0980 0.0815 0.0655 0.0652 0.0852 0.0764 0.0759 0.0885 0.0904 0.0822 0.0693 0.0684 0.0550 0.0680 0.0531 0.0656 0.0960 0.0746 0.0872 0.0759 0.1043 0.0735 0.0877 0.1770 0.1595 0.1268
va: 3.3395 3.0483 3.2770 2.7688 3.0623 3.8271 3.7825 3.9290 3.8254 3.8491 3.5795 3.8712 3.8863 3.9074 4.1388 3.8966 4.3524 3.9404 3.9164 4.0702 1.0156 1.0069 1.0153 1.0198 1.0101 1.0093 1.0116 1.0140 1.0127 1.0040 1.0110 1.0121 1.0060 1.0092 1.0060 1.0250 1.0026 1.0068 1.0023 1.0074 1.0049 1.0059 1.0392 1.0295 1.0002
dispcorr: -0.019280787 hartree
energy: -860.530631252656
dipole: 2.22633 -2.14164 0.08470 44.69477 -42.21843 2.47633 -8.23327 8.74795 0.51468
magnitude: 2.53067 au
magnitude: 6.43246 debye
