program: Orca
programVersion: 5.0.2
elementType: N N N N N C C C C C C C C C C C C C C C H H H H H H H H H H H H H H H H H H H H H H H H H
charge: 0
multiplicity: 1
keywords: wb97x-d3
keywords: def2-TZVPP
keywords: def2/J RIJCOSX
keywords: DEFGRID2
keywords: scfconv7
keywords: smallprint printgap noloewdin
keywords: NOSOSCF
formula: C15H25N5
InChI: InChI=1/C15H25N5/c1-3-5-6-7-8-9-10-12-13(4-2)19-15-17-11-18-20(15)14(12)16/h11H,3-10,16H2,1-2H3
45 atoms
N  -0.652943 -1.321351 1.38765
N  -0.017024 -1.651131 -0.854452
N  0.607358 -0.311459 3.010798
N  -1.696395 -1.54905 2.199317
N  -2.137444 -2.270727 0.10033
C  1.697449 2.40136 0.19132
C  2.578632 1.70365 1.236854
C  0.29844 2.742392 0.707076
C  2.724057 0.183689 1.029054
C  -0.71699 3.037283 -0.394071
C  1.444169 -0.550685 0.729576
C  -1.201035 1.776719 -1.101437
C  1.122738 -1.067887 -0.55465
C  -2.222374 2.027939 -2.202341
C  0.505852 -0.717419 1.733041
C  2.125624 -0.97424 -1.678993
C  -0.916723 -1.761756 0.114202
C  -2.69909 0.735375 -2.850964
C  1.631301 -1.515039 -3.009019
C  -2.546339 -2.115784 1.364471
H  1.620461 1.775434 -0.701353
H  2.177287 3.323986 -0.144277
H  3.585416 2.12723 1.234306
H  2.180767 1.917149 2.233444
H  -0.082816 1.922619 1.322663
H  0.379527 3.600518 1.381035
H  3.217504 -0.253663 1.905601
H  3.427009 0.01821 0.21388
H  -1.579667 3.552155 0.039071
H  -0.286273 3.73386 -1.122035
H  -1.641183 1.102818 -0.357731
H  -0.353187 1.231952 -1.527524
H  -1.787561 2.685667 -2.961524
H  -3.078011 2.571161 -1.789101
H  3.03534 -1.505667 -1.379774
H  2.432995 0.068583 -1.80221
H  -3.162171 0.071129 -2.119868
H  -3.428063 0.925564 -3.639044
H  -1.866868 0.184951 -3.292895
H  2.409303 -1.40347 -3.764414
H  0.745257 -0.982966 -3.351064
H  1.367425 -2.568262 -2.941722
H  -0.107519 -0.596596 3.65918
H  1.494832 -0.023689 3.376036
H  -3.520576 -2.43272 1.704724
totalener: -860.50616132 hartree
nucrepener: 1700.23677251 hartree
electener: -2560.74293383 hartree
oneelecener: -4542.59900354 hartree
twoeener: 1981.85606971 hartree
kineticenergy: 856.59095121 hartree
xcener: -85.957781334690 hartree
chargesum: -0.0000000
charge: 0.179683 -0.278166 -0.253367 -0.394923 -0.305989 -0.105879 -0.137484 -0.146890 -0.260983 -0.133311 0.061256 -0.079251 0.120028 -0.101498 0.115148 -0.124612 0.162026 -0.228416 -0.241142 0.095023 0.052318 0.087470 0.088471 0.060377 0.072511 0.086994 0.093479 0.093305 0.067617 0.057411 0.051261 0.029706 0.050011 0.052261 0.088972 0.081104 0.076413 0.083091 0.068602 0.081587 0.082799 0.089285 0.174008 0.162386 0.127305
qa: 0.1797 -0.2782 -0.2534 -0.3949 -0.3060 -0.1059 -0.1375 -0.1469 -0.2610 -0.1333 0.0613 -0.0793 0.1200 -0.1015 0.1151 -0.1246 0.1620 -0.2284 -0.2411 0.0950 0.0523 0.0875 0.0885 0.0604 0.0725 0.0870 0.0935 0.0933 0.0676 0.0574 0.0513 0.0297 0.0500 0.0523 0.0890 0.0811 0.0764 0.0831 0.0686 0.0816 0.0828 0.0893 0.1740 0.1624 0.1273
va: 3.3243 2.9523 3.2580 2.7696 3.0428 3.8182 3.8572 3.9198 3.9064 3.9428 3.4809 3.9057 3.8145 3.9221 4.1597 3.8692 4.3542 3.9354 3.9762 4.0703 1.0211 1.0100 1.0171 1.0138 1.0071 1.0082 1.0024 1.0101 1.0112 1.0092 1.0074 1.0122 1.0070 1.0080 0.9984 0.9979 1.0141 1.0055 1.0074 1.0031 1.0050 1.0122 1.0400 1.0256 1.0006
dispcorr: -0.024882567 hartree
energy: -860.531043887582
dipole: 6.83247 -5.17650 1.65596 20.33285 -19.40852 0.92433 -13.92975 15.22229 1.29254
magnitude: 2.29505 au
magnitude: 5.83356 debye
