program: Orca
programVersion: 5.0.2
elementType: N N N N N C C C C C C C C C C C C C C C H H H H H H H H H H H H H H H H H H H H H H H H H
charge: 0
multiplicity: 1
keywords: wb97x-d3
keywords: def2-TZVPP
keywords: def2/J RIJCOSX
keywords: DEFGRID2
keywords: scfconv7
keywords: smallprint printgap noloewdin
keywords: NOSOSCF
formula: C15H25N5
InChI: InChI=1/C15H25N5/c1-3-5-6-7-8-9-10-12-13(4-2)19-15-17-11-18-20(15)14(12)16/h11H,3-10,16H2,1-2H3
45 atoms
N  -0.51751 -1.634798 0.91481
N  0.919616 -2.497147 -0.737895
N  -0.063347 0.085843 2.350444
N  -1.755122 -1.826987 1.395961
N  -1.310839 -3.278108 -0.281917
C  1.451978 2.612379 0.345922
C  2.642645 1.665137 0.189498
C  0.220456 2.267894 -0.486784
C  2.605763 0.388836 1.043404
C  -0.978249 3.148871 -0.160864
C  1.570953 -0.63893 0.671865
C  -2.214333 2.811403 -0.983996
C  1.795153 -1.5949 -0.355963
C  -3.41985 3.679245 -0.645257
C  0.355338 -0.688691 1.331684
C  3.124286 -1.615949 -1.067342
C  -0.247613 -2.512192 -0.105792
C  -4.649638 3.338766 -1.474577
C  3.237256 -2.659255 -2.164786
C  -2.169624 -2.822874 0.636442
H  1.77179 3.622472 0.073904
H  1.179869 2.686258 1.406917
H  2.757167 1.402096 -0.865951
H  3.554649 2.203571 0.46032
H  0.473937 2.369264 -1.547036
H  -0.060218 1.221606 -0.35531
H  2.493895 0.674217 2.094885
H  3.593164 -0.075251 1.000076
H  -1.218482 3.049386 0.904253
H  -0.713421 4.201535 -0.309446
H  -2.47289 1.757513 -0.833497
H  -1.980871 2.912901 -2.049211
H  -3.160345 4.732436 -0.789767
H  -3.655264 3.571474 0.418121
H  3.912445 -1.780023 -0.324419
H  3.325915 -0.623236 -1.479827
H  -5.497864 3.971206 -1.212053
H  -4.457596 3.471646 -2.540421
H  -4.953659 2.3016 -1.3245
H  4.225663 -2.609047 -2.621672
H  2.493301 -2.503119 -2.943474
H  3.090828 -3.665204 -1.777419
H  -1.025968 0.001883 2.633477
H  0.410007 0.946005 2.550242
H  -3.158187 -3.236976 0.765712
totalener: -860.50981280 hartree
nucrepener: 1617.48905211 hartree
electener: -2477.99886491 hartree
oneelecener: -4376.63362486 hartree
twoeener: 1898.63475994 hartree
kineticenergy: 856.59736341 hartree
xcener: -85.955719967011 hartree
chargesum: -0.0000000
charge: 0.161694 -0.306965 -0.269853 -0.397199 -0.305513 -0.171536 -0.116701 -0.126936 -0.195540 -0.108288 -0.120650 -0.100901 0.204217 -0.081716 0.191468 -0.127964 0.201219 -0.257149 -0.238639 0.095617 0.089090 0.047418 0.072686 0.085542 0.078090 0.074346 0.084977 0.100289 0.042644 0.062782 0.058681 0.055261 0.051697 0.051091 0.075170 0.083024 0.083863 0.072362 0.075671 0.078487 0.086542 0.089235 0.177341 0.167473 0.127577
qa: 0.1617 -0.3070 -0.2699 -0.3972 -0.3055 -0.1715 -0.1167 -0.1269 -0.1955 -0.1083 -0.1206 -0.1009 0.2042 -0.0817 0.1915 -0.1280 0.2012 -0.2571 -0.2386 0.0956 0.0891 0.0474 0.0727 0.0855 0.0781 0.0743 0.0850 0.1003 0.0426 0.0628 0.0587 0.0553 0.0517 0.0511 0.0752 0.0830 0.0839 0.0724 0.0757 0.0785 0.0865 0.0892 0.1773 0.1675 0.1276
va: 3.3302 3.0039 3.2724 2.7715 3.0667 3.9053 3.8563 3.8593 3.8655 3.8755 3.6004 3.8822 3.7948 3.8909 4.0665 3.8981 4.3665 3.9570 3.9677 4.0672 1.0097 1.0122 1.0118 1.0097 1.0145 1.0040 1.0136 1.0118 1.0167 1.0142 1.0143 1.0118 1.0077 1.0069 1.0033 1.0008 1.0058 1.0034 1.0034 1.0024 1.0117 1.0126 1.0404 1.0346 0.9999
dispcorr: -0.020649867 hartree
energy: -860.530462670843
dipole: 0.62815 0.22297 0.85112 29.40303 -27.42392 1.97910 -8.41004 9.34058 0.93055
magnitude: 2.34674 au
magnitude: 5.96493 debye
