program: Orca
programVersion: 5.0.2
elementType: N N N N N C C C C C C C C C C C C C C C H H H H H H H H H H H H H H H H H H H H H H H H H
charge: 0
multiplicity: 1
keywords: wb97x-d3
keywords: def2-TZVPP
keywords: def2/J RIJCOSX
keywords: DEFGRID2
keywords: scfconv7
keywords: smallprint printgap noloewdin
keywords: NOSOSCF
formula: C15H25N5
InChI: InChI=1/C15H25N5/c1-3-5-6-7-8-9-10-12-13(4-2)19-15-17-11-18-20(15)14(12)16/h11H,3-10,16H2,1-2H3
45 atoms
N  -0.818592 -1.25273 0.901929
N  0.177694 -1.677768 -1.187163
N  0.137246 -0.137659 2.656266
N  -1.975843 -1.464563 1.547009
N  -2.058617 -2.30652 -0.551772
C  2.194231 2.655855 -0.094411
C  2.334607 1.838702 1.190762
C  0.965538 2.388545 -0.963616
C  2.54081 0.323255 1.029878
C  -0.375307 2.489528 -0.246702
C  1.344488 -0.460463 0.553466
C  -1.532965 1.980409 -1.097258
C  1.244009 -1.050117 -0.732879
C  -2.848988 1.884442 -0.335646
C  0.257172 -0.604758 1.400033
C  2.41281 -1.033258 -1.680248
C  -0.864745 -1.764828 -0.370522
C  -3.970136 1.288359 -1.174854
C  3.400351 -2.156012 -1.366121
C  -2.669704 -2.096396 0.618715
H  3.093654 2.514771 -0.703085
H  2.198083 3.712107 0.192019
H  3.204469 2.22428 1.730224
H  1.480012 2.038056 1.841822
H  0.979362 3.097172 -1.797599
H  1.043245 1.404562 -1.428835
H  2.876482 -0.079954 1.993834
H  3.387144 0.156345 0.363781
H  -0.352382 1.911978 0.680944
H  -0.55923 3.525774 0.05741
H  -1.277649 0.989838 -1.489834
H  -1.660263 2.622174 -1.97564
H  -3.138985 2.876333 0.024726
H  -2.70265 1.268534 0.557422
H  2.923179 -0.06825 -1.664302
H  2.018484 -1.167209 -2.686833
H  -3.720037 0.276197 -1.497591
H  -4.904432 1.235003 -0.615319
H  -4.157128 1.883144 -2.07063
H  4.225139 -2.155881 -2.078519
H  2.907462 -3.125914 -1.423459
H  3.825061 -2.058879 -0.36607
H  -0.669273 -0.418502 3.189274
H  0.951172 0.167036 3.155361
H  -3.680959 -2.419314 0.814619
totalener: -860.50822465 hartree
nucrepener: 1711.45817233 hartree
electener: -2571.96639698 hartree
oneelecener: -4564.81321437 hartree
twoeener: 1992.84681739 hartree
kineticenergy: 856.59479740 hartree
xcener: -85.958953522050 hartree
chargesum: -0.0000000
charge: 0.189523 -0.267941 -0.245416 -0.392140 -0.297869 -0.176946 -0.131141 -0.110736 -0.234090 -0.128402 0.032636 -0.153557 0.135656 -0.094320 0.096882 -0.148603 0.180594 -0.257174 -0.258292 0.091406 0.073024 0.082267 0.087491 0.066834 0.085004 0.062367 0.102681 0.086755 0.051526 0.085795 0.071723 0.077017 0.063307 0.046957 0.065741 0.101221 0.080443 0.081203 0.074828 0.089010 0.102206 0.073841 0.171462 0.161172 0.126054
qa: 0.1895 -0.2679 -0.2454 -0.3921 -0.2979 -0.1769 -0.1311 -0.1107 -0.2341 -0.1284 0.0326 -0.1536 0.1357 -0.0943 0.0969 -0.1486 0.1806 -0.2572 -0.2583 0.0914 0.0730 0.0823 0.0875 0.0668 0.0850 0.0624 0.1027 0.0868 0.0515 0.0858 0.0717 0.0770 0.0633 0.0470 0.0657 0.1012 0.0804 0.0812 0.0748 0.0890 0.1022 0.0738 0.1715 0.1612 0.1261
va: 3.3222 3.0083 3.2505 2.7524 3.0353 3.9308 3.8359 3.8864 3.8664 3.8660 3.4173 3.8892 3.8816 3.8625 4.1873 3.8548 4.3454 3.9411 3.9205 4.0528 1.0076 1.0074 1.0100 1.0164 1.0104 1.0143 0.9965 1.0136 1.0042 1.0107 1.0072 1.0118 1.0095 1.0220 1.0086 1.0263 1.0131 1.0057 1.0043 1.0058 1.0055 1.0038 1.0416 1.0256 1.0023
dispcorr: -0.025867541 hartree
energy: -860.534092188011
dipole: 7.92079 -6.41844 1.50235 19.70365 -18.69470 1.00895 -5.08199 6.58812 1.50613
magnitude: 2.35445 au
magnitude: 5.98454 debye
