program: Gaussian 09
title: 000069317
version: EM64L-G09RevD.01
frameworkgroup: C1[X(C14H14S2)]
method: RPBEPBE
basis: SDD
operation: Freq
keyword: #pfreq=noraman
keyword: PBEPBE/SDD
title: #p freq=noraman PBEPBE/SDD
converged: YES YES NO NO
title: Mulliken charges:
elementType: S S C C C C C C C C C C C C C C H H H H H H H H H H H H H H
charge: 0.171651 0.186056 -0.631883 -0.615850 -0.176155 -0.148318 -0.248580 -0.171563 -0.233830 -0.248979 -0.208754 -0.247935 -0.211535 -0.212284 -0.228548 -0.240045 0.275375 0.272617 0.271537 0.272562 0.256068 0.244072 0.253282 0.240952 0.231552 0.226615 0.231379 0.228409 0.232024 0.230110
chargesum: 0.00000
title: Mulliken charges with hydrogens summed into heavy atoms:
elementType: S S C C C C C C C C C C C C C C
charge: 0.171651 0.186056 -0.083891 -0.071751 -0.176155 -0.148318 0.007487 0.072509 0.019452 -0.008028 0.022798 -0.021320 0.019843 0.016125 0.003476 -0.009935
polarizability: 2.99303096e+02 -1.94503386e+01 1.47441493e+02 -3.74390256e+00 -1.42778789e+00 1.18270113e+02
1716.lowfreq: -12.2587 -5.6865 0.0008 0.0013 0.0016 1.1176 8.5919 12.7898 16.7226
frequency: -7.9052 10.1349 16.3350 32.6035 72.0276 81.9916 108.5730 174.5204 178.7992 203.0160 262.6084 277.1611 323.1205 402.0622 405.4097 412.4768 420.4300 468.3332 490.6998 610.5965 610.7430 651.4859 675.6698 678.0321 692.3329 697.1022 739.8236 741.6001 762.5719 791.6423 835.4455 851.6749 896.4354 927.5681 951.0551 966.4946 979.1403 983.2511 985.8432 987.3205 998.4935 1014.8439 1019.2882 1056.7854 1070.0055 1073.2406 1073.3663 1082.7147 1103.4490 1171.7640 1172.9405 1179.7506 1193.2814 1228.5105 1266.7799 1289.5828 1296.1084 1313.9409 1372.3635 1375.5772 1424.6500 1428.2291 1457.0840 1459.9128 1461.7036 1467.9362 1583.8672 1586.3322 1587.2580 1594.2397 3016.4326 3032.8960 3087.1566 3115.6011 3125.4310 3127.6505 3131.9498 3136.5734 3145.3879 3148.7586 3157.5832 3157.8332 3169.0494 3169.1509
redmass: 5.0841 6.2744 3.8857 6.0760 6.3573 3.1120 2.2896 5.6167 4.7933 5.6589 5.3673 5.2661 5.5933 2.8432 2.8968 9.3020 10.1212 3.1864 3.5077 6.4698 6.4617 9.0762 7.0703 6.8630 2.1651 2.1753 2.8311 1.5577 2.0016 1.1149 1.2487 1.2409 1.3737 1.3778 1.3041 1.3764 1.3924 6.2648 6.3022 1.3089 1.3190 3.3198 3.2634 4.2101 1.5919 2.5310 2.4588 1.6181 1.0396 1.0545 1.0502 1.1123 1.1243 1.1614 1.1848 1.2539 1.3273 1.3322 9.7096 6.7962 2.0771 2.2100 1.8310 1.3357 1.1564 1.5575 6.0418 6.3083 6.0546 5.9317 1.0560 1.0558 1.1085 1.1103 1.0848 1.0848 1.0879 1.0883 1.0933 1.0929 1.0968 1.0949 1.1009 1.1015
irintensity: 0.1619 0.3559 0.0008 0.4149 0.2025 2.7601 1.3480 0.4808 0.3199 0.9448 0.9421 1.0120 2.8735 0.0081 0.0464 0.1127 4.2000 11.8812 19.8816 0.2686 0.4022 4.1802 34.0527 6.9202 34.1222 38.4326 27.3916 81.7724 44.3869 4.2246 0.7253 0.0635 1.3739 2.6386 0.1904 0.1338 0.0452 2.4038 6.4978 0.0634 0.0911 17.7957 29.4077 0.2583 8.7608 29.0070 6.6304 8.4525 0.6792 0.0072 0.4022 1.9908 0.0776 10.1302 0.2101 0.1394 0.8332 2.6720 0.8068 2.3706 9.4808 8.4588 36.7638 11.0919 40.8908 21.5595 6.8938 1.6382 12.7631 68.3380 5.9519 13.6699 1.8858 17.7475 3.5618 0.2867 1.6963 4.2397 19.6146 17.3991 25.1563 34.8458 28.5205 8.1389
temp: 298.150 k
press: 1.00000 atm
elementType: 16 16 6 6 6 6 6 6 6 6 6 6 6 6 6 6 1 1 1 1 1 1 1 1 1 1 1 1 1 1
symmnumber: 1
zpe: 618957.3 jmol-1
zpe.correction: 0.235748 hartree
zpe.thermalcorrener: 0.250534 hartree
zpe.thermalcorrenthalpy: 0.251478 hartree
zpe.thermalcorrgfe: 0.189448 hartree
zpe.sumelectzpe: -1336.853546 hartree
zpe.sumelectthermal: -1336.838761 hartree
zpe.sumelectthermalent: -1336.837817 hartree
zpe.sumelectthermalfe: -1336.899846 hartree
dipole: 0.8944 -0.4419 -0.0213
dipole: 0.9978
quadrupole: -89.6664 -109.4847 -108.5591
quadrupole: -8.4516 -1.1655 -0.9196
quadrupole: 12.9037 -6.9147 -5.9890 -8.4516 -1.1655 -0.9196
hfenergy: -1337.0892947 hartree
pointgroup: C01 [X(C14H14S2)]
dipole: -0.3563796 -0.1121173 -0.1205993 debye
polarizability: 300.2137478|13.0046129|128.336889|9.1888208|13.5959127|136.4640654 unknown
InChI: InChI=1S/C14H14S2/c1-3-7-13(8-4-1)15-11-12-16-14-9-5-2-6-10-14/h1-10H,11-12H2
charge 0 multiplicity 1
30 atoms
S  -1.877766 0.941659 1.070462
S  1.786014 -0.885618 -0.843441
C  -0.767239 -0.152686 -0.038192
C  0.691753 0.199897 0.258087
C  -3.530189 0.376679 0.459535
C  3.478886 -0.370807 -0.345673
C  -4.250735 -0.597964 1.188762
C  3.752768 0.62999 0.617142
C  -4.082553 0.944407 -0.712962
C  4.550997 -1.040504 -0.990911
C  -5.527352 -1.009463 0.738309
C  5.093548 0.954995 0.92965
C  -5.356218 0.525154 -1.162584
C  5.884432 -0.707669 -0.672141
C  -6.079491 -0.451522 -0.438201
C  6.164328 0.29199 0.290317
H  -0.989855 -1.206003 0.197582
H  -1.032404 0.055932 -1.08761
H  0.89785 1.258386 0.024797
H  0.943545 -0.007601 1.312182
H  -3.815008 -1.024003 2.098405
H  2.944686 1.161889 1.128056
H  -3.52401 1.71256 -1.258433
H  4.343671 -1.816795 -1.736358
H  -6.08587 -1.762657 1.304999
H  5.294951 1.731134 1.67671
H  -5.783269 0.965273 -2.070524
H  6.703722 -1.231738 -1.176925
H  -7.068024 -0.771758 -0.785842
H  7.200233 0.548244 0.536502
