program: Gaussian 09
title: 000074265
version: EM64L-G09RevD.01
frameworkgroup: C1[X(C16H16N2)]
method: RPBEPBE
basis: SDD
operation: Freq
keyword: #pfreq=noraman
keyword: PBEPBE/SDD
title: #p freq=noraman PBEPBE/SDD
converged: NO NO NO NO
title: Mulliken charges:
elementType: N N C C C C C C C C C C C C C C C C H H H H H H H H H H H H H H H H
charge: 0.059202 0.059206 0.314546 0.314542 -0.157715 -0.157717 0.217269 0.217266 -0.435913 -0.435913 0.317376 0.317380 -0.551896 -0.551898 -0.843156 -0.843156 -0.843612 -0.843612 0.239595 0.239595 0.247213 0.247212 0.240178 0.240151 0.254645 0.254644 0.240179 0.240151 0.233863 0.234130 0.234125 0.233863 0.234135 0.234120
chargesum: 0.00000
title: Mulliken charges with hydrogens summed into heavy atoms:
elementType: N N C C C C C C C C C C C C C C C C
charge: 0.059202 0.059206 0.314546 0.314542 -0.157715 -0.157717 0.217269 0.217266 -0.196318 -0.196318 0.317376 0.317380 -0.304684 -0.304686 -0.108182 -0.108182 -0.141493 -0.141494
polarizability: 3.25192731e+02 1.31015608e-04 1.95979356e+02 -8.06252782e-03 8.26487725e-03 9.07543708e+01
1716.lowfreq: -0.0004 0.0005 0.0008 2.8985 3.3122 17.5887 53.4191 67.8152 115.6443
frequency: 53.4067 67.8143 115.6161 118.2614 129.7514 144.8700 161.0219 180.8946 181.9630 225.5753 254.0898 283.8548 287.7622 303.9804 327.8234 328.6251 361.1685 441.8928 450.0015 468.0018 502.7218 514.0056 520.6920 548.7034 557.6389 598.0917 618.0119 620.6515 632.3719 698.5396 748.4957 787.2861 830.7065 843.8668 846.2050 851.6723 913.8382 920.5555 941.7864 958.8541 972.8643 999.0007 1015.0301 1026.0297 1026.5203 1052.0802 1052.3586 1077.1378 1088.9243 1174.0643 1184.9804 1195.5842 1226.8626 1262.1027 1280.2903 1308.2876 1332.3873 1337.8374 1356.9475 1382.1915 1397.8173 1398.2832 1403.3015 1403.8037 1420.0199 1431.0691 1456.0482 1456.0492 1467.1330 1467.1445 1482.5568 1487.1463 1489.8111 1489.8127 1501.3863 1502.3400 1535.9484 1568.9673 1584.7318 1613.7263 2973.9618 2974.1167 2978.6870 2978.9006 3049.1556 3049.2044 3052.0411 3052.0532 3079.2937 3079.3096 3095.1972 3095.9629 3108.1302 3108.4010 3131.5140 3156.0561
redmass: 3.9227 3.4178 1.3996 3.7336 1.0248 1.7402 3.9381 1.0883 1.0625 3.3349 3.4805 4.3263 3.6739 3.2705 2.6667 2.9080 4.5159 3.9838 3.4044 5.2773 6.1534 4.7487 2.9964 4.2157 4.4394 4.7817 4.7335 6.0587 3.0654 5.5220 2.6268 5.4208 1.8825 3.9407 3.5359 7.7035 1.3708 1.3892 3.1102 2.4791 1.3202 1.4252 1.5735 1.4600 1.4620 1.6422 1.6417 2.2387 2.0381 5.6564 2.1145 2.5087 3.0285 2.9192 2.0185 4.4907 2.8540 6.4629 2.5289 3.0724 1.2509 1.2442 1.2403 1.2010 2.2691 6.4770 1.2627 1.3084 1.0466 1.0466 1.3020 1.1006 1.0456 1.0456 2.7971 2.0419 5.2073 5.9051 6.7029 6.7184 1.0373 1.0373 1.0400 1.0400 1.0971 1.0971 1.0978 1.0977 1.0983 1.0983 1.0910 1.0912 1.0954 1.0954 1.0854 1.0966
irintensity: 3.3979 0.0000 2.2397 0.0000 0.0000 0.1151 3.1879 0.0000 1.3392 0.0000 3.0167 0.0028 1.1667 0.0303 0.9182 0.0005 0.0000 1.8588 0.0000 2.8886 1.6322 0.2187 1.8398 1.1012 1.6720 3.3600 0.0000 0.4416 0.0000 0.1797 24.1002 1.4209 25.0217 5.8049 8.1250 0.0000 14.5126 0.0000 11.5015 6.1242 0.0000 16.2216 1.0164 0.0000 17.7296 0.0000 2.2581 6.7957 1.2548 0.6230 1.7865 0.0514 8.1566 0.7697 26.9923 0.2920 4.0256 0.2542 0.3122 2.1857 4.3797 28.2270 31.1924 9.4839 39.9925 3.1677 2.9077 0.2832 51.7109 0.0001 0.8960 34.2780 0.0118 0.2759 2.5699 68.9935 5.3025 12.6319 3.4273 5.0569 82.6800 0.8208 13.8335 33.8837 0.2889 37.0866 10.4874 20.6177 0.8845 27.9358 38.3128 47.5547 47.2570 0.0028 0.1573 26.0671
temp: 298.150 k
press: 1.00000 atm
elementType: 7 7 6 6 6 6 6 6 6 6 6 6 6 6 6 6 6 6 1 1 1 1 1 1 1 1 1 1 1 1 1 1 1 1
symmnumber: 1
zpe: 725006.6 jmol-1
zpe.correction: 0.276140 hartree
zpe.thermalcorrener: 0.292256 hartree
zpe.thermalcorrenthalpy: 0.293200 hartree
zpe.thermalcorrgfe: 0.233619 hartree
zpe.sumelectzpe: -727.563263 hartree
zpe.sumelectthermal: -727.547147 hartree
zpe.sumelectthermalent: -727.546203 hartree
zpe.sumelectthermalfe: -727.605784 hartree
dipole: 0.0000 4.6547 0.0003
dipole: 4.6547
quadrupole: -74.4775 -105.8266 -109.4940
quadrupole: 0.0000 -0.0022 0.0006
quadrupole: 22.1218 -9.2272 -12.8947 0.0000 -0.0022 0.0006
hfenergy: -727.839403 hartree
pointgroup: C01 [X(C16H16N2)]
dipole: -0.000006 -1.8312808 -0.0001062 debye
polarizability: 325.1927306|-0.0008728|195.9793558|0.0080626|0.0082648|90.7543708 unknown
InChI: InChI=1S/C16H16N2/c1-9-7-17-15-13(11(9)3)5-6-14-12(4)10(2)8-18-16(14)15/h5-8H,1-4H3
charge 0 multiplicity 1
34 atoms
N  1.389856 1.762383 0.000288
N  -1.389847 1.762394 0.000146
C  1.447805 -0.704987 0.00005
C  -1.447825 -0.704972 0.000033
C  0.733863 0.551372 0.000162
C  -0.733866 0.551384 0.000117
C  2.889363 -0.693344 0.000078
C  -2.889378 -0.693312 0.000039
C  0.691435 -1.934872 -0.00006
C  -0.691467 -1.934864 -0.000074
C  3.547787 0.557815 0.000265
C  -3.547791 0.557855 0.000099
C  2.737228 1.737237 0.000345
C  -2.73722 1.737265 0.000112
C  3.659613 -2.001609 0.000006
C  -3.659639 -2.001572 -0.00013
C  5.058472 0.705176 0.00038
C  -5.058473 0.705237 0.000113
H  1.225465 -2.890826 -0.00011
H  -1.225507 -2.890813 -0.000176
H  3.229211 2.719725 0.0005
H  -3.22919 2.719762 0.000125
H  3.415354 -2.612841 0.889706
H  3.414433 -2.613327 -0.889094
H  4.747247 -1.834028 -0.000596
H  -4.747271 -1.83398 0.000444
H  -3.415338 -2.612654 -0.889919
H  -3.414513 -2.613444 0.888879
H  5.342655 1.771918 0.000563
H  5.519276 0.237659 0.890988
H  5.519381 0.237945 -0.890329
H  -5.342643 1.771982 0.000443
H  -5.519321 0.238151 -0.890705
H  -5.519353 0.237586 0.890613
