program: Gaussian 09
title: 000069283
version: EM64L-G09RevD.01
frameworkgroup: C1[X(C21H21O6P)]
method: RPBEPBE
basis: SDD
operation: Freq
keyword: #p
keyword: freq=noraman
keyword: PBEPBE/SDD
title: #p freq=noraman PBEPBE/SDD
converged: YES YES NO NO
title: Mulliken charges:
elementType: P O O O O O O C C C C C C C C C C C C C C C C C C C C C H H H H H H H H H H H H H H H H H H H H H
charge: 1.070180 -0.565140 -0.533014 -0.565444 -0.440758 -0.461200 -0.440271 0.522616 0.544289 0.551856 -0.447235 -0.481449 -0.456167 -0.529321 -0.466468 -0.519809 -0.391733 -0.453773 -0.444699 0.309426 0.310016 0.309607 -0.189373 -0.185400 -0.197597 -0.404841 -0.408850 -0.401012 0.228790 0.213469 0.262102 0.220509 0.209754 0.229848 0.257001 0.286886 0.255369 0.274187 0.237021 0.291295 0.227774 0.226043 0.225254 0.218720 0.220008 0.220224 0.352331 0.355142 0.353837
chargesum: 0.00000
title: Mulliken charges with hydrogens summed into heavy atoms:
elementType: P O O O O O O C C C C C C C C C C C C C C C C C C C C C
charge: 1.070180 -0.565140 -0.533014 -0.565444 -0.088427 -0.106058 -0.086434 0.522616 0.544289 0.551856 -0.004976 0.001162 -0.016565 -0.272321 -0.179582 -0.264440 -0.117547 -0.216752 -0.153404 0.309426 0.310016 0.309607 0.038401 0.040642 0.027658 -0.186121 -0.188842 -0.180787
polarizability: 2.81724471e+02 -1.49886184e+01 2.82173063e+02 -1.92909196e+01 -2.08839996e+01 2.53757374e+02
1716.lowfreq: -6.3556 -4.2629 -1.6650 0.0013 0.0014 0.0020 7.7094 9.6054 12.9154
frequency: 7.4158 8.8732 12.7074 21.0329 31.9528 33.7230 42.0458 49.2383 63.7876 81.3540 110.5844 115.6948 145.2617 169.7569 187.4686 215.9220 225.3300 226.3447 229.6063 258.3241 275.5876 282.1299 289.4390 294.7375 327.4310 349.5309 351.1921 352.6574 374.2384 409.2652 421.1104 422.8392 430.6366 451.8003 453.4914 460.4745 512.5112 514.8087 517.1944 534.1245 535.8100 543.9125 561.4816 590.3495 595.6485 646.8507 657.2958 666.9150 701.4957 702.8059 704.6837 733.7435 739.9592 744.5849 785.2258 791.4317 791.9563 866.5995 877.4074 884.3141 890.9490 894.1208 895.0011 907.2368 912.6464 917.1948 927.2595 935.6338 941.1834 963.9191 977.1188 981.3975 984.1351 984.5613 985.9487 987.1188 992.1132 996.5841 1088.5399 1091.5805 1097.6293 1138.7063 1139.4825 1145.9255 1170.4097 1176.2521 1176.9815 1181.2538 1181.8010 1185.5874 1198.9879 1212.9981 1215.0922 1263.8301 1269.1861 1272.1347 1310.3555 1310.6642 1316.2265 1342.5751 1343.7666 1347.5003 1395.6188 1396.1195 1396.7028 1463.2618 1465.4684 1468.2095 1469.6653 1476.7767 1478.9306 1482.2381 1483.3983 1486.1456 1594.4070 1596.0394 1596.5826 1627.9191 1628.9018 1630.0847 2972.9393 3005.7075 3016.8444 3038.1359 3073.2723 3086.6485 3113.4617 3114.2162 3114.7078 3133.9229 3134.8389 3138.7755 3150.4905 3152.8755 3153.6119 3156.5885 3159.2149 3160.1698 3582.1332 3582.5863 3583.0400
redmass: 6.7237 5.2480 5.9752 5.6267 5.4768 5.7757 5.2101 5.2567 5.5483 6.1554 5.4560 5.5335 6.9947 7.4538 7.3942 6.1544 4.3373 4.3613 4.5048 4.8977 4.3306 3.0321 4.6131 3.3418 4.6989 1.1318 1.1263 1.1245 5.0833 4.9459 3.0663 2.9587 3.0558 3.2422 3.2773 3.5601 6.6298 7.0188 6.8699 5.0747 5.0068 4.9425 8.7459 7.2733 6.6919 4.9676 5.4257 4.8465 2.5512 2.4976 2.7624 4.0485 4.0656 3.7848 1.7172 1.5710 1.5769 2.1715 2.4892 1.8485 1.4254 1.9122 1.4747 2.4917 1.9158 2.9356 2.9444 2.9381 3.6143 1.3405 1.3567 1.4637 5.3439 4.6341 1.8346 4.9820 1.7818 1.9737 1.6093 1.6370 1.6543 1.4020 1.4030 1.4290 1.2191 1.1953 1.3589 1.3985 1.3719 1.2401 1.0986 1.1020 1.1109 3.1894 3.3541 2.9030 1.2973 1.2680 1.2897 1.2722 1.2880 1.2282 6.8695 7.0550 6.9625 1.2479 2.6284 2.6767 2.1761 1.7550 2.6214 1.2451 1.6769 1.6810 6.5474 6.5759 6.3814 6.3033 6.2558 6.2775 1.0584 1.0566 1.0587 1.1061 1.1091 1.1068 1.0886 1.0884 1.0884 1.0911 1.0898 1.0903 1.0928 1.0932 1.0926 1.0987 1.0989 1.0983 1.0659 1.0660 1.0660
irintensity: 0.3191 0.1782 0.1956 0.2504 0.2266 0.6193 0.6014 0.9190 0.2609 2.4733 2.2632 4.9471 5.6981 6.6980 4.4283 6.1879 0.2299 1.8371 0.3130 1.4318 10.8735 5.5654 4.7177 3.6947 7.5159 123.8249 73.2168 199.6978 19.1800 12.8896 9.5540 4.5542 4.1208 5.7956 6.4000 10.0850 1.5386 1.4757 4.6125 6.1065 16.1320 7.2892 60.3603 27.3744 21.2533 69.1708 88.9071 23.3433 11.5848 47.4113 3.0550 30.2794 34.7415 36.1677 59.6538 58.7305 77.6263 133.6971 255.2281 126.9485 4.4968 36.5806 7.5435 97.2498 42.9103 4.1400 36.8849 61.5544 53.3259 0.2483 2.7133 1.7558 0.6509 0.7519 17.2598 0.9553 5.7052 8.0566 15.1158 4.1771 5.3520 151.6396 155.8589 101.6558 22.6461 3.5193 30.9205 60.9317 29.8407 15.7058 1.3402 0.1142 2.3101 57.6341 75.0512 74.1669 4.6261 16.4243 13.3527 13.5846 21.5245 29.3104 3.6882 11.7324 14.1149 6.6920 34.0555 33.0464 36.6568 15.2240 16.7466 2.4956 8.8251 8.1174 45.4068 56.2082 55.2146 47.9795 17.3866 38.0436 52.2319 50.9882 22.2485 23.1686 14.9291 13.6813 17.1882 17.4774 10.3529 6.9130 12.5291 5.4457 8.0491 3.4542 7.0551 13.3104 21.3907 13.3382 32.3419 35.5435 36.1889
temp: 298.150 k
press: 1.00000 atm
elementType: 15 8 8 8 8 8 8 6 6 6 6 6 6 6 6 6 6 6 6 6 6 6 6 6 6 6 6 6 1 1 1 1 1 1 1 1 1 1 1 1 1 1 1 1 1 1 1 1 1
symmnumber: 1
zpe: 983308.4 jmol-1
zpe.correction: 0.374522 hartree
zpe.thermalcorrener: 0.401841 hartree
zpe.thermalcorrenthalpy: 0.402785 hartree
zpe.thermalcorrgfe: 0.310663 hartree
zpe.sumelectzpe: -1603.367910 hartree
zpe.sumelectthermal: -1603.340591 hartree
zpe.sumelectthermalent: -1603.339647 hartree
zpe.sumelectthermalfe: -1603.431770 hartree
dipole: 1.8537 1.6080 -5.1065
dipole: 5.6656
quadrupole: -155.5717 -154.1829 -156.7626
quadrupole: -5.0127 0.5692 -2.7429
quadrupole: -0.0659 1.3228 -1.2569 -5.0127 0.5692 -2.7429
hfenergy: -1603.7424323 hartree
pointgroup: C01 [X(C21H21O6P1)]
dipole: -0.1553864 0.7025931 2.1096631 debye
polarizability: 278.1852189|19.5810575|276.5624833|-20.8108469|20.2726288|262.9072065 unknown
InChI: InChI=1S/C21H21O6P/c22-19-7-1-4-16(10-19)13-25-28(26-14-17-5-2-8-20(23)11-17)27-15-18-6-3-9-21(24)12-18/h1-12,22-24H,13-15H2
charge 0 multiplicity 1
49 atoms
P  -0.282749 0.15956 -2.996557
O  0.573218 -1.34155 -2.656972
O  1.106045 1.208393 -2.944531
O  -1.012626 0.257082 -1.348368
O  3.407928 -5.303215 0.228974
O  0.188807 3.336597 1.942468
O  -5.818886 -1.49239 0.629386
C  0.840066 -2.802293 -0.705661
C  2.196844 2.218054 -0.967213
C  -2.941729 0.765404 0.03811
C  -0.034244 -2.476208 -1.898219
C  2.209885 1.057503 -1.94035
C  -2.113485 1.244538 -1.133322
C  1.727781 -3.899814 -0.757224
C  1.222331 2.264951 0.057043
C  -4.013418 -0.131657 -0.175326
C  0.774857 -2.001239 0.466012
C  3.152926 3.260099 -1.071199
C  -2.630917 1.193369 1.356022
C  2.549158 -4.194208 0.354637
C  1.201085 3.34955 0.956263
C  -4.767389 -0.603281 0.920913
C  1.599156 -2.303909 1.56939
C  3.128915 4.338028 -0.158351
C  -3.392393 0.714536 2.444763
C  2.49184 -3.400464 1.52437
C  2.15291 4.393869 0.861391
C  -4.463086 -0.184267 2.238702
H  -1.052551 -2.198657 -1.570431
H  -0.079145 -3.323259 -2.605178
H  2.099256 0.082305 -1.432238
H  3.135011 1.048867 -2.540309
H  -2.724659 1.323312 -2.054949
H  -1.657694 2.22994 -0.921201
H  1.801385 -4.530056 -1.649666
H  0.479373 1.465318 0.144103
H  -4.274487 -0.475631 -1.181853
H  0.079164 -1.155565 0.49592
H  3.907186 3.228532 -1.865278
H  -1.801871 1.889695 1.528051
H  1.548636 -1.688356 2.474177
H  3.868666 5.141965 -0.239035
H  -3.154711 1.042243 3.462734
H  3.130425 -3.632679 2.387074
H  2.133717 5.235954 1.565722
H  -5.052285 -0.550684 3.089833
H  3.945302 -5.424688 1.050649
H  0.254122 4.135582 2.522089
H  -6.282669 -1.771973 1.457237
