program: Gaussian 09
title: 000074398
version: EM64L-G09RevD.01
frameworkgroup: C1[X(C20H22O9)]
method: RPBEPBE
basis: SDD
operation: Freq
keyword: #pfreq=noraman
keyword: PBEPBE/SDD
title: #p freq=noraman PBEPBE/SDD
converged: YES YES NO NO
title: Mulliken charges:
elementType: O O O O O O O O O C C C C C C C C C C C C C C C C C C C C H H H H H H H H H H H H H H H H H H H H H H
charge: -0.360031 -0.251480 -0.249941 -0.236162 -0.236426 -0.290736 -0.291902 -0.195719 -0.196269 0.306993 0.306020 0.059049 0.058315 0.256928 0.256202 0.302424 0.303691 -0.490746 -0.490729 -0.527197 -0.527115 0.154200 0.155542 -0.512484 -0.512803 -0.536660 -0.536363 -0.533907 -0.533659 0.283557 0.284095 0.282709 0.282852 0.216433 0.259625 0.234097 0.260534 0.214959 0.234571 0.248414 0.224278 0.219572 0.216426 0.228189 0.248539 0.243449 0.232723 0.229785 0.243447 0.227247 0.235465
chargesum: 0.00000
title: Mulliken charges with hydrogens summed into heavy atoms:
elementType: O O O O O O O O O C C C C C C C C C C C C C C C C C C C C
charge: -0.360031 -0.251480 -0.249941 -0.236162 -0.236426 -0.290736 -0.291902 -0.195719 -0.196269 0.306993 0.306020 0.059049 0.058315 0.256928 0.256202 0.302424 0.303691 -0.207189 -0.206634 -0.244488 -0.244263 0.154200 0.155542 0.197671 0.197260 0.155604 0.156791 0.172049 0.172499
polarizability: 4.29587456e+02 3.91970392e+00 2.68685057e+02 -1.63566081e+01 2.94572270e-01 1.79242276e+02
1716.lowfreq: -3.0698 -0.0004 0.0004 0.0007 1.6809 4.8366 11.8561 13.5773 20.5461
frequency: 11.7452 13.5063 20.5366 35.2248 48.8371 55.5733 58.0141 61.0397 69.9765 84.1813 91.7823 108.3681 110.3546 126.2564 130.4765 147.2180 153.5432 155.6145 162.9731 184.4332 185.3122 195.0336 200.4461 208.6678 212.7893 217.3887 245.6551 254.1063 277.2959 284.7419 290.2752 306.2207 314.0633 319.6772 332.1295 353.7379 354.2157 393.9052 409.5379 424.3069 467.8445 482.9329 493.2889 523.7482 532.5658 553.0517 559.2750 578.4941 579.2337 612.7973 645.1884 665.9829 694.2059 706.2932 714.5935 729.0917 769.6633 770.9292 779.0642 835.8442 858.2119 861.1116 867.3992 872.8873 881.4186 889.3890 889.9276 952.3377 953.3942 970.1250 981.8347 1036.6699 1058.0421 1089.8829 1091.3051 1108.1444 1108.5658 1111.1316 1111.2240 1111.7404 1112.7658 1133.8715 1147.7880 1148.8211 1156.3145 1156.9317 1157.6728 1161.0818 1174.1437 1218.6439 1223.6965 1224.0733 1231.0315 1304.3946 1328.0244 1392.4078 1392.8204 1417.0778 1417.6954 1420.8552 1421.6528 1442.4218 1443.4855 1446.5518 1447.1132 1454.8842 1455.5107 1465.9929 1466.1394 1466.4511 1467.6791 1467.9255 1469.4787 1472.7443 1473.4896 1476.3626 1477.6376 1486.3057 1487.5998 1582.5778 1583.5629 1591.6440 1592.3993 1620.6504 1675.0105 2959.6609 2960.1490 2969.4488 2969.5215 2985.0919 2986.0572 3047.8818 3049.1080 3061.3157 3061.3259 3095.5955 3096.2005 3128.0228 3128.8417 3128.9414 3129.3224 3135.2990 3135.6414 3172.8672 3175.8735 3191.9935 3192.6655
redmass: 4.9556 5.5959 5.4475 1.8689 2.3793 2.8733 2.5937 6.4579 4.8944 3.3211 3.8395 3.6722 3.6800 4.5022 3.7642 2.0951 2.4574 2.6485 3.9243 4.0224 3.3790 1.5378 1.6750 4.2547 3.7439 4.0449 1.2821 1.2075 3.3370 1.9206 1.9830 4.7932 5.8460 5.6688 6.9774 4.4412 4.3521 6.2919 6.5495 6.1242 7.0214 7.3036 6.9618 7.3516 7.4291 5.4769 5.3263 4.8270 4.8298 8.5843 4.5583 4.5507 6.3657 5.5812 5.1270 5.2629 3.9017 3.3762 10.5044 8.4627 1.4665 1.4461 6.7741 7.0886 3.3955 2.3345 2.0879 8.9279 8.9283 10.2915 9.8842 4.7307 2.8703 7.4332 6.9846 1.2393 1.2360 1.2605 1.2604 1.2591 1.2569 2.3646 1.3799 1.3452 1.4464 1.4487 1.5405 1.4493 3.4033 2.9300 1.5193 1.5506 2.0806 5.6224 6.3798 3.8714 3.9230 2.6897 2.7742 1.4065 1.3861 1.2029 1.2130 1.4817 1.4504 1.1280 1.1169 1.0500 1.0547 1.0798 1.1758 1.0653 1.1783 1.1104 1.1097 1.0603 1.0656 1.9853 2.1568 8.6141 8.4608 6.0363 6.0897 12.4845 12.7596 1.0331 1.0333 1.0323 1.0323 1.0336 1.0332 1.1039 1.1037 1.1044 1.1044 1.0982 1.0987 1.0994 1.1005 1.1005 1.0995 1.1052 1.1052 1.0906 1.0906 1.0910 1.0910
irintensity: 0.0790 0.5072 0.3602 7.9331 3.6682 3.3346 8.7669 5.8421 3.1739 6.4079 2.0880 0.1417 0.8562 4.9566 0.1483 7.3358 3.3162 0.7435 11.1283 10.0242 22.9741 0.0967 0.7238 1.4167 4.7215 2.5135 1.0874 0.4653 1.0534 0.1630 0.1570 6.3778 1.2034 1.8490 4.9538 1.2245 1.5738 3.9495 5.7670 9.1508 4.6492 8.3087 0.7265 2.2405 4.5059 10.4305 0.6533 1.4522 5.2524 89.2539 5.2968 10.9176 2.1427 18.9944 158.7174 17.4185 7.8098 31.6722 11.4034 1.1915 3.5698 14.3392 248.9621 0.4673 502.9257 252.0909 133.0920 88.8672 42.4286 420.5663 12.1630 739.3508 17.8805 248.0683 277.8445 36.9329 21.2075 0.4131 0.0997 0.2878 0.1095 749.9607 5.1612 22.4173 29.9718 46.0720 14.3008 3.1249 21.6532 4.6038 90.7767 51.5268 31.7446 740.0806 97.5231 65.8444 28.4138 77.6456 78.9431 34.1483 11.0534 0.9378 0.4810 63.7364 59.3160 9.9689 8.8898 4.2989 20.6180 31.1614 77.5025 2.8580 94.8291 72.5554 45.2927 30.5597 35.3023 78.0813 57.1798 148.0550 167.1013 59.1531 38.5627 146.3937 327.7801 49.4342 65.9666 40.7042 64.2304 100.8076 89.8148 43.9115 42.8357 19.2195 55.9408 38.3529 36.2128 21.7555 31.9065 16.7026 22.2632 14.5370 14.3525 3.6116 3.5546 1.8604 1.9116
temp: 298.150 k
press: 1.00000 atm
elementType: 8 8 8 8 8 8 8 8 8 6 6 6 6 6 6 6 6 6 6 6 6 6 6 6 6 6 6 6 6 1 1 1 1 1 1 1 1 1 1 1 1 1 1 1 1 1 1 1 1 1 1
symmnumber: 1
zpe: 1018166.8 jmol-1
zpe.correction: 0.387799 hartree
zpe.thermalcorrener: 0.418856 hartree
zpe.thermalcorrenthalpy: 0.419800 hartree
zpe.thermalcorrgfe: 0.321960 hartree
zpe.sumelectzpe: -1450.087774 hartree
zpe.sumelectthermal: -1450.056717 hartree
zpe.sumelectthermalent: -1450.055773 hartree
zpe.sumelectthermalfe: -1450.153614 hartree
dipole: -0.2237 1.6959 -1.7345
dipole: 2.4361
quadrupole: -131.9745 -167.7528 -161.5240
quadrupole: 7.9567 -17.2789 -2.8806
quadrupole: 21.7759 -14.0024 -7.7736 7.9567 -17.2789 -2.8806
hfenergy: -1450.4755735 hartree
pointgroup: C01 [X(C20H22O9)]
dipole: -0.0867366 -0.7000795 0.6488018 debye
polarizability: 429.8699468|-6.5125526|268.5514111|12.6143984|4.756754|179.0934317 unknown
InChI: InChI=1S/C20H22O9/c1-23-13-7-11(8-14(24-2)17(13)27-5)19(21)29-20(22)12-9-15(25-3)18(28-6)16(10-12)26-4/h7-10H,1-6H3
charge 0 multiplicity 1
51 atoms
O  -0.022518 0.728562 0.108217
O  -5.961148 -1.597906 0.524591
O  5.922969 -1.429081 -0.834385
O  -3.662871 -2.591138 1.388708
O  3.605357 -2.315589 -1.75672
O  -6.112714 0.947576 -0.708976
O  6.084779 0.856486 0.836264
O  -1.157482 2.630712 -0.686922
O  1.117509 2.436941 1.257283
C  -2.432791 0.665734 -0.013758
C  2.387717 0.63658 0.214985
C  -4.844034 -0.78729 0.362726
C  4.793687 -0.736557 -0.415278
C  -3.589022 -1.333222 0.783972
C  3.538417 -1.18189 -0.942248
C  -4.857799 0.496155 -0.269709
C  4.815535 0.431069 0.41171
C  -2.390651 -0.613129 0.592809
C  2.343616 -0.500446 -0.62765
C  -3.662258 1.220016 -0.444482
C  3.619982 1.102104 0.733713
C  -1.211507 1.475943 -0.222427
C  1.168635 1.394402 0.576942
C  -7.194788 -1.021291 1.104627
C  6.952721 -1.809297 0.157884
C  -2.402949 -3.191168 1.835922
C  2.35487 -2.769227 -2.372205
C  -6.158119 2.23981 -1.402938
C  6.153985 2.10084 1.611167
H  -1.427664 -1.008054 0.920439
H  1.378624 -0.829983 -1.015922
H  -3.64423 2.20637 -0.915525
H  3.607813 1.996615 1.361696
H  -6.976895 -0.577113 2.093998
H  -7.630068 -0.262931 0.435757
H  -7.869434 -1.882516 1.220403
H  7.437151 -0.919444 0.588231
H  6.499147 -2.421641 0.959917
H  7.671202 -2.414524 -0.414611
H  -2.689673 -4.161095 2.267265
H  -1.910014 -2.568673 2.60787
H  -1.708352 -3.349277 0.987993
H  1.616186 -3.079892 -1.607346
H  1.914182 -1.982686 -3.014634
H  2.640287 -3.635709 -2.985952
H  -7.215393 2.382864 -1.669517
H  -5.539121 2.220648 -2.319804
H  -5.822087 3.062367 -0.743323
H  7.225986 2.260679 1.797439
H  5.61603 2.006411 2.573724
H  5.741795 2.950885 1.035481
