program: Gaussian 09
title: 000069274
version: EM64L-G09RevD.01
frameworkgroup: C1[X(C8H9NO)]
method: RPBEPBE
basis: SDD
operation: Freq
keyword: #pfreq=noraman
keyword: PBEPBE/SDD
title: #p freq=noraman PBEPBE/SDD
converged: NO YES NO NO
title: Mulliken charges:
elementType: O N C C C C C C C C H H H H H H H H H
charge: -0.281948 -0.638340 0.450976 0.290774 -0.401345 -0.381450 -0.318649 -0.356444 -0.802522 0.156452 0.231413 0.234116 0.194132 0.278629 0.228477 0.226160 0.239454 0.313908 0.336208
chargesum: 0.00000
title: Mulliken charges with hydrogens summed into heavy atoms:
elementType: O N C C C C C C C C
charge: -0.281948 0.011775 0.450976 0.290774 -0.169932 -0.147335 -0.124517 -0.077814 -0.108431 0.156452
polarizability: 1.39625993e+02 -1.03280440e+00 1.01035853e+02 5.07074259e-01 1.29429974e-02 4.39573829e+01
1716.lowfreq: -36.7397 -12.6484 -8.8909 -6.3000 -0.0007 -0.0006 -0.0004 28.2307 101.0918
frequency: -36.5898 27.4303 101.0846 195.3187 267.2944 337.2308 343.4850 389.6624 445.6911 468.0999 483.0898 555.9823 580.1449 634.8559 682.9017 692.2913 739.9485 806.2584 825.1844 864.7856 947.8870 986.6960 1003.1175 1010.9196 1045.9298 1047.6180 1119.7270 1131.6450 1197.7041 1227.7169 1310.0757 1354.0039 1374.4915 1396.9598 1410.1721 1470.0784 1472.3445 1507.3620 1560.1380 1593.8619 1623.4617 1634.1921 2976.0951 3057.8247 3088.3215 3110.5141 3126.6772 3136.8697 3161.4065 3534.9853 3690.0605
redmass: 3.8867 1.0269 4.1188 4.3305 3.8868 2.8161 5.8419 2.2360 1.7642 3.4885 1.7121 4.7935 1.2450 6.9511 3.7578 3.4929 2.5197 5.2032 1.6736 1.3426 1.3774 1.4094 1.3606 3.1085 1.9019 1.5873 2.3744 1.5092 1.1247 2.8751 1.2830 4.0005 5.0980 1.2253 3.5874 1.1015 1.0552 2.6253 4.1810 2.5132 5.3895 2.2378 1.0389 1.0945 1.1000 1.0867 1.0896 1.0962 1.0951 1.0448 1.1038
irintensity: 13.4940 0.7003 0.2041 9.1192 0.5246 3.4718 0.5768 6.1492 13.4019 4.4267 167.6165 12.0911 70.0761 1.2177 4.7212 53.7360 51.1747 0.4605 18.1006 14.5475 1.3182 0.4033 2.9871 5.0046 2.7659 19.6875 1.5241 18.7267 12.3303 0.1974 0.5736 251.1322 30.2187 12.4307 11.2482 11.3495 13.1163 6.1806 99.1884 65.4400 44.6895 235.3846 27.8673 21.8769 17.0591 19.0645 20.0189 22.6435 4.3536 36.8482 29.3079
temp: 298.150 k
press: 1.00000 atm
elementType: 8 7 6 6 6 6 6 6 6 6 1 1 1 1 1 1 1 1 1
symmnumber: 1
zpe: 399251.3 jmol-1
zpe.correction: 0.152067 hartree
zpe.thermalcorrener: 0.160770 hartree
zpe.thermalcorrenthalpy: 0.161714 hartree
zpe.thermalcorrgfe: 0.117580 hartree
zpe.sumelectzpe: -439.526098 hartree
zpe.sumelectthermal: -439.517395 hartree
zpe.sumelectthermalent: -439.516451 hartree
zpe.sumelectthermalfe: -439.560585 hartree
dipole: 2.2318 3.7000 0.0418
dipole: 4.3212
quadrupole: -52.8048 -53.4569 -62.9241
quadrupole: -12.2265 0.2915 0.0510
quadrupole: 3.5905 2.9383 -6.5288 -12.2265 0.2915 0.0510
hfenergy: -439.6781648 hartree
pointgroup: C01 [X(C8H9N1O1)]
dipole: 0.9014545 -1.4413828 -0.0125629 debye
dipolederiv: -0.9115306 0.2634595 -0.0028075 0.1500814 -0.886998 0.002761 -0.0034975 0.006614 -0.3788992 -0.7653108 -0.4724893 0.0059166 -0.4836488 -0.831712 -0.0013775 0.0038028 -0.0045282 -0.7084005 0.4938125 -0.0042083 -0.0220472 0.0533255 0.0121218 0.0005081 -0.0920017 -0.0017929 -0.018359 -0.584575 -0.0405974 0.0024536 0.0471334 -0.0806471 0.0014083 -0.0030607 0.0008082 0.0049323 -0.294028 -0.0887985 0.0000392 -0.2520614 0.0509236 0.0070901 0.0069178 0.0068338 -0.1679024 -0.2189464 0.1239917 0.0014289 0.2115242 0.0793623 -0.0065956 0.0083482 -0.0032661 -0.1740128 0.1223865 0.0576008 -0.0001487 -0.0477992 0.052485 -0.0041857 0.0104838 -0.0022091 -0.152545 0.061146 -0.0688529 -0.0019536 0.0667748 0.0352335 0.0047941 0.0077378 0.0005028 -0.1050593 -0.1964851 -0.0019975 0.0174139 -0.0025335 0.0804087 -0.0015437 0.1456047 -0.0011145 0.0593344 1.7207285 0.17408 0.0030282 0.2475565 1.3687797 -0.0061754 0.0044636 -0.0061197 0.2423524 0.0074782 0.1001999 -0.0035742 0.100049 -0.059954 -0.0012495 -0.0068094 0.0033542 0.151271 0.010321 -0.1020352 -0.0038511 -0.0985354 -0.056228 0.0006118 -0.0067631 -0.0045456 0.1492975 0.0052836 -0.1237293 -0.0013029 -0.1231978 -0.0782497 -0.0000429 -0.0034268 0.000762 0.1481669 0.1140822 0.0785471 -0.0003102 0.0407027 0.0261909 -0.0009663 -0.0024508 -0.0008563 0.1540487 0.0218979 -0.0235564 -0.0213774 -0.1007401 -0.0644805 -0.0985915 -0.0805874 -0.077391 0.0655843 0.0179169 0.024836 -0.0235754 0.1011211 -0.0620226 0.1012124 -0.0828992 0.0789403 0.0623735 -0.029679 -0.0013718 0.0549645 -0.0008031 0.1144484 -0.0013152 0.0986501 0.0000826 -0.0954533 0.2343135 0.0798333 -0.0024478 0.0740871 0.1240087 0.0022241 -0.0025672 0.0025796 0.3788191 0.1911881 0.0250886 -0.0018488 0.0169637 0.1763294 0.0014334 -0.001945 0.0013459 0.3844515 unknown
polarizability: 139.5846034|1.6536871|101.0790965|-0.274938|-0.0579023|43.9555293 unknown
InChI: InChI=1S/C8H9NO/c1-6-2-4-7(5-3-6)8(9)10/h2-5H,9H2,1H3
charge 0 multiplicity 1
19 atoms
O  -2.827463 1.166918 -0.020781
N  -2.93798 -1.139984 -0.006182
C  2.147756 -0.015809 0.016701
C  -0.717378 -0.040189 0.000904
C  1.427294 -1.238311 0.014159
C  1.405883 1.194489 0.017169
C  0.017758 -1.254046 0.004681
C  -0.001431 1.183859 0.007463
C  3.664648 -0.005009 -0.007397
C  -2.223212 0.048498 -0.006656
H  1.978722 -2.186409 0.020846
H  1.940576 2.151999 0.026699
H  -0.487318 -2.227729 0.00318
H  -0.583184 2.11156 0.008399
H  4.070195 0.896333 0.484304
H  4.085509 -0.892926 0.496149
H  4.041787 -0.00839 -1.048817
H  -2.499932 -2.056808 0.004806
H  -3.954931 -1.074647 -0.015128
