program: Gaussian 09
title: 000069258
version: EM64L-G09RevD.01
frameworkgroup: C1[X(C8H7IO2)]
method: RPBEPBE
basis: SDD
operation: Freq
keyword: #pfreq=noraman
keyword: PBEPBE/SDD
title: #p freq=noraman PBEPBE/SDD
converged: NO YES NO NO
title: Mulliken charges:
elementType: I O O C C C C C C C C H H H H H H H
charge: 0.109049 -0.287090 -0.248532 0.241018 -0.270407 -0.329607 -0.316423 -0.199824 -0.169249 0.187641 -0.500110 0.289509 0.276040 0.239311 0.254846 0.245098 0.233617 0.245113
chargesum: 0.00000
title: Mulliken charges with hydrogens summed into heavy atoms:
elementType: I O O C C C C C C C C
charge: 0.109049 -0.287090 -0.248532 0.241018 0.019102 -0.053567 -0.316423 0.039487 0.085597 0.187641 0.223718
polarizability: 1.83728959e+02 -7.16300005e+00 1.16343864e+02 3.97584168e-03 2.41939752e-03 4.43627814e+01
1716.lowfreq: -9.8107 0.0005 0.0006 0.0009 5.7087 11.7363 41.6369 81.4656 97.2722
frequency: 41.6110 81.4644 97.2640 112.8520 153.1333 191.2097 206.0927 247.5313 310.0295 359.6635 423.0872 476.2711 486.2748 636.7030 673.0259 677.3056 720.4674 777.4807 808.1628 925.4322 930.7255 946.2078 982.4098 996.2541 1055.6354 1081.8313 1095.0295 1114.2595 1147.8040 1180.1588 1236.9586 1288.5568 1376.9652 1406.8751 1422.8971 1450.5426 1454.8166 1462.7840 1564.9843 1594.8976 1626.3492 3006.5984 3109.6474 3146.0577 3151.2781 3170.3353 3172.8368 3184.2461
redmass: 4.8000 1.1423 6.7880 3.7975 4.7287 6.1769 4.3768 6.7731 4.4842 6.8796 3.1168 6.7556 5.3561 6.9661 3.6012 7.1378 2.7961 6.3211 1.5570 8.7511 1.3539 1.4585 6.1866 1.3587 3.5603 2.5909 1.6067 1.2630 1.4855 1.0894 3.1016 1.3407 10.6705 2.6266 1.2238 1.0498 2.3033 1.0522 6.9600 6.5505 10.1577 1.0294 1.1047 1.0878 1.1050 1.0939 1.0926 1.0975
irintensity: 1.8910 0.9004 0.3865 1.9685 0.0806 1.4690 4.7824 3.9425 18.8308 0.7340 1.4611 5.0607 8.9692 9.3668 4.4753 35.8266 60.2031 35.4821 27.9267 27.2506 1.8240 10.6279 3.5484 0.3393 21.6940 97.6120 7.9827 0.0301 60.8998 14.9634 402.2509 16.9972 2.4328 47.0112 42.0400 14.7723 3.3529 12.2344 60.5569 0.2463 156.7050 37.5397 25.1345 5.7992 15.7880 3.8591 1.7461 6.4909
temp: 298.150 k
press: 1.00000 atm
elementType: 53 8 8 6 6 6 6 6 6 6 6 1 1 1 1 1 1 1
symmnumber: 1
zpe: 339518.2 jmol-1
zpe.correction: 0.129316 hartree
zpe.thermalcorrener: 0.140091 hartree
zpe.thermalcorrenthalpy: 0.141035 hartree
zpe.thermalcorrgfe: 0.090175 hartree
zpe.sumelectzpe: -470.211466 hartree
zpe.sumelectthermal: -470.200691 hartree
zpe.sumelectthermalent: -470.199747 hartree
zpe.sumelectthermalfe: -470.250607 hartree
dipole: -2.0102 2.5162 0.0020
dipole: 3.2206
quadrupole: -61.0945 -75.6207 -81.0697
quadrupole: -1.6970 -0.0057 -0.0111
quadrupole: 11.5005 -3.0257 -8.4747 -1.6970 -0.0057 -0.0111
hfenergy: -470.3407819 hartree
pointgroup: C01 [X(C8H7I1O2)]
dipole: -0.5168058 1.1568114 0.0148154 debye
dipolederiv: -0.3516711 0.2394505 0.0132303 0.2736574 -0.2110852 -0.0100681 0.0130506 -0.0086495 0.0008911 -1.5748771 0.2496888 0.0532091 0.5043172 -0.6061393 -0.0198438 0.0523394 -0.0090106 -0.2969001 -0.7875949 -0.1896893 0.0208174 -0.0863274 -0.8876827 0.0064588 0.0205088 0.0113821 -0.322751 -0.551075 -0.1063976 0.0243935 -0.2808056 0.0051994 0.011724 0.0254599 0.004346 0.0070995 -0.270873 0.2564727 0.0071665 0.1497959 -0.146205 -0.0057756 0.0076589 -0.0102859 -0.0610118 0.0230937 -0.063336 -0.0054588 0.1359924 -0.0495815 -0.0062628 -0.0069205 0.0023149 -0.1182541 0.7955471 -0.7117238 -0.0355343 -0.765205 0.3873498 0.0285782 -0.0351804 0.0263182 -0.1596538 -0.0851818 -0.0121496 -0.0022328 0.1130439 0.1217405 -0.0065029 -0.0029352 -0.0012587 -0.1400063 -0.195094 0.2789461 0.0027312 0.1668771 -0.1477654 -0.0067109 0.0034626 -0.0113941 -0.0864834 2.0659946 0.0387039 -0.0780421 -0.2266798 1.1798156 0.0050736 -0.0769528 -0.0067021 0.2423664 0.7760359 -0.0416227 -0.0209088 0.0554307 0.2155126 -0.0019991 -0.0217495 0.002184 0.2805808 0.1635545 -0.0313162 -0.0000099 0.0035963 0.028367 0.0007752 -0.0001603 0.0021721 0.1579842 0.0559839 0.0770156 0.0037905 0.0813875 0.0614454 -0.0027195 0.0037829 -0.0026695 0.1600735 0.0459695 -0.0125477 0.0049122 -0.0264378 -0.1072994 0.0029345 0.0048849 0.0024051 0.1610036 -0.0348575 -0.0593138 0.008575 -0.0462295 0.0956277 0.0023807 0.0085202 0.0029353 0.1590602 -0.0284017 0.0069089 0.0040004 -0.0972972 0.0508167 -0.0965087 -0.0484507 -0.0796492 -0.050328 -0.021953 0.0673046 0.0058194 0.1331541 -0.0427938 -0.0048674 0.0054907 -0.0020692 0.1221323 -0.0245999 0.0136055 -0.006459 -0.0882703 0.0526777 0.1033338 0.0471906 0.0776311 -0.0558032 unknown
polarizability: 175.7771914|-22.6397387|124.0707563|-5.3944327|0.4186961|44.5876571 unknown
InChI: InChI=1S/C8H7IO2/c1-11-8(10)6-3-2-4-7(9)5-6/h2-5H,1H3
charge 0 multiplicity 1
18 atoms
I  3.799083 -1.717979 -0.124003
O  -2.607977 0.504005 0.132641
O  -1.898901 -1.715026 0.114703
C  -0.248781 0.085723 0.034286
C  0.836029 -0.829381 -0.004648
C  -0.008505 1.482653 0.014182
C  2.150604 -0.331865 -0.063735
C  1.317484 1.959709 -0.044606
C  2.408198 1.058111 -0.084077
C  -1.625759 -0.490158 0.09593
C  -4.005004 0.009477 0.195076
H  0.618481 -1.901041 0.012061
H  -0.855809 2.172366 0.044865
H  1.514164 3.036754 -0.060209
H  3.434341 1.434666 -0.129771
H  -4.229999 -0.606354 -0.691625
H  -4.622648 0.917955 0.216958
H  -4.1530 -0.597115 1.104071
