program: Gaussian 09
title: 000007622
version: EM64L-G09RevD.01
frameworkgroup: C1[X(C12H27N)]
method: RPBEPBE
basis: SDD
operation: Freq
keyword: #pfreq=noraman
keyword: PBEPBE/SDD
title: #p freq=noraman PBEPBE/SDD
converged: YES YES NO NO
title: Mulliken charges:
elementType: N C C C C C C C C C C C C H H H H H H H H H H H H H H H H H H H H H H H H H H H
charge: -0.104176 -0.357694 -0.358412 -0.358618 -0.358453 -0.358345 -0.357833 -0.340130 -0.340601 -0.340171 -0.695346 -0.695156 -0.695429 0.177485 0.198515 0.178227 0.198700 0.178829 0.198387 0.208048 0.184601 0.208033 0.185124 0.207504 0.185541 0.190499 0.190964 0.190615 0.190836 0.190944 0.190476 0.214250 0.209218 0.212207 0.214164 0.209249 0.212176 0.214175 0.209392 0.212204
chargesum: 0.00000
title: Mulliken charges with hydrogens summed into heavy atoms:
elementType: N C C C C C C C C C C C C
charge: -0.104176 0.018306 0.018515 0.018598 0.034196 0.034811 0.035213 0.041334 0.040849 0.041249 -0.059671 -0.059567 -0.059658
polarizability: 1.51971112e+02 8.78693161e-03 1.51531294e+02 -4.82365742e-02 3.05875874e-02 1.18336428e+02
1716.lowfreq: -5.3527 -0.0002 0.0005 0.0006 5.1668 9.4823 30.3732 37.9836 39.9747
frequency: 30.0067 37.9699 39.9238 43.1561 54.3889 62.4268 97.2056 110.0605 114.5143 151.8366 156.4466 179.0192 218.6537 232.4406 234.2441 252.1996 278.4536 282.1228 302.7305 396.3289 396.8686 452.0707 505.0593 505.8480 729.3553 731.2543 732.2963 787.8334 792.5287 794.2226 828.1869 897.6126 897.7274 898.5841 924.1344 925.6448 927.9705 1008.8684 1009.1812 1031.3937 1067.1802 1068.1517 1075.5658 1086.0117 1087.3016 1105.5517 1111.9612 1112.2274 1145.4177 1189.7112 1190.3920 1221.9322 1234.0018 1235.3087 1262.7258 1268.4582 1269.3684 1279.1975 1282.2309 1283.1685 1287.4941 1299.5709 1302.3283 1342.4531 1342.8229 1343.9766 1367.0086 1369.8327 1378.7266 1389.0313 1389.2194 1390.2840 1463.7886 1464.3358 1465.8499 1469.9557 1470.6805 1471.6188 1475.7123 1477.0750 1477.5857 1478.6767 1480.6463 1481.3370 1487.7113 1489.0510 1489.9376 2834.0499 2835.9957 2851.4632 2961.1293 2961.3804 2961.6842 2971.7888 2971.8946 2972.1207 2975.2265 2976.4244 2977.2796 3002.8221 3002.9992 3003.4061 3015.0473 3017.5115 3018.2046 3042.8513 3045.9122 3046.2514 3068.7214 3069.1776 3069.3517 3070.4326 3070.5486 3070.8284
redmass: 1.8037 3.1039 2.9949 2.6418 1.5231 1.5583 2.7020 2.3077 2.2966 2.6932 2.6801 2.2069 1.1384 1.1199 1.1142 3.7228 2.4657 2.4478 2.5967 3.0299 3.0267 2.8005 2.9995 3.0028 1.0761 1.0757 1.0736 1.2211 1.1810 1.1816 3.9902 1.7342 1.7341 1.7289 1.2516 1.2687 1.2130 3.0675 3.0576 3.4697 2.3747 2.3964 2.3279 2.2377 2.2388 2.0439 2.2716 2.2818 1.7530 2.0638 2.0715 1.3465 1.4468 1.4607 1.2692 1.3086 1.3097 1.0737 1.0924 1.0924 1.1588 1.2637 1.2617 1.5033 1.5173 1.5241 1.4018 1.3829 1.4210 1.2157 1.2166 1.2433 1.0702 1.0704 1.0734 1.0694 1.0702 1.0781 1.0424 1.0428 1.0425 1.0733 1.0673 1.0657 1.0842 1.0871 1.0897 1.0714 1.0713 1.0707 1.0586 1.0587 1.0586 1.0374 1.0377 1.0374 1.0596 1.0602 1.0607 1.0973 1.0973 1.0974 1.0865 1.0892 1.0894 1.1024 1.1011 1.1014 1.1005 1.1005 1.1006 1.0995 1.0995 1.0995
irintensity: 0.0502 0.0098 0.0238 0.0329 0.0562 0.0724 0.0446 0.0244 0.0228 0.5981 0.6328 0.1893 0.0082 0.0144 0.0312 0.2282 0.0928 0.0873 2.2422 0.6424 0.6665 6.9357 4.0649 4.1869 8.5559 8.7448 8.7164 0.0787 0.0215 0.0565 12.3066 16.3339 14.9895 2.2137 5.6174 7.4665 0.8286 1.6425 1.4852 0.0087 11.9185 12.7275 1.3566 32.2690 31.5884 1.4856 0.8896 0.8793 6.8348 12.4138 12.7574 0.4021 5.9035 6.5098 0.2653 2.1422 2.7615 0.1401 0.2876 0.4010 0.0976 14.7425 13.2774 0.6052 0.8764 1.0490 12.9828 12.7076 4.8318 6.3501 6.5317 11.8513 0.6938 0.6318 0.2037 0.7572 0.7467 0.2629 12.4100 12.5468 11.9148 3.3748 4.4281 4.2514 21.9871 11.1487 10.5274 41.4777 40.7801 213.7921 21.1304 24.2894 34.3948 40.9721 44.4121 11.4575 48.7624 46.4857 55.2766 12.7641 8.8512 5.9759 6.9899 11.0099 9.3948 39.9433 58.4462 58.2108 58.4744 109.3723 117.6929 47.6819 47.4749 69.2591
temp: 298.150 k
press: 1.00000 atm
elementType: 7 6 6 6 6 6 6 6 6 6 6 6 6 1 1 1 1 1 1 1 1 1 1 1 1 1 1 1 1 1 1 1 1 1 1 1 1 1 1 1
symmnumber: 1
zpe: 968005.3 jmol-1
zpe.correction: 0.368694 hartree
zpe.thermalcorrener: 0.386910 hartree
zpe.thermalcorrenthalpy: 0.387854 hartree
zpe.thermalcorrgfe: 0.319937 hartree
zpe.sumelectzpe: -527.090054 hartree
zpe.sumelectthermal: -527.071838 hartree
zpe.sumelectthermalent: -527.070894 hartree
zpe.sumelectthermalfe: -527.138812 hartree
dipole: 0.0079 -0.0005 -0.7564
dipole: 0.7564
quadrupole: -85.0461 -85.0576 -86.9838
quadrupole: -0.0176 0.0267 0.0028
quadrupole: 0.6497 0.6383 -1.2880 -0.0176 0.0267 0.0028
hfenergy: -527.4587482 hartree
pointgroup: C01 [X(C12H27N1)]
dipole: 0.001018 0.0006694 0.2975913 debye
polarizability: 151.6028586|0.1626493|151.8967418|-0.0087717|0.3119245|118.3392332 unknown
InChI: InChI=1S/C12H27N/c1-4-7-10-13(11-8-5-2)12-9-6-3/h4-12H2,1-3H3
charge 0 multiplicity 1
40 atoms
N  0.001777 0.009702 0.35408
C  -0.076147 1.437089 0.761308
C  1.278654 -0.641324 0.749817
C  -1.196161 -0.772569 0.758648
C  0.728612 2.376564 -0.161934
C  1.684327 -1.792838 -0.194614
C  -2.400728 -0.565195 -0.184212
C  0.65604 3.85526 0.283129
C  2.987113 -2.498298 0.247521
C  -3.650967 -1.357382 0.261916
C  1.45752 4.797341 -0.641125
C  3.400172 -3.641052 -0.705062
C  -4.848275 -1.172566 -0.695436
H  0.259199 1.581377 1.821796
H  -1.138523 1.745347 0.728057
H  1.236306 -1.021574 1.803904
H  2.078292 0.123215 0.728298
H  -1.502421 -0.538356 1.811506
H  -0.927717 -1.846111 0.746627
H  0.340817 2.269073 -1.193609
H  1.790702 2.059244 -0.19311
H  1.800168 -1.382027 -1.216416
H  0.867526 -2.540766 -0.250547
H  -2.100362 -0.870297 -1.205535
H  -2.654182 0.512812 -0.243106
H  1.034105 3.946024 1.322448
H  -0.405038 4.178737 0.309764
H  2.857892 -2.899844 1.273842
H  3.806634 -1.752571 0.30728
H  -3.942253 -1.04144 1.284954
H  -3.396351 -2.435193 0.331204
H  1.389423 5.84908 -0.306837
H  2.527779 4.517073 -0.660179
H  1.080673 4.746972 -1.680052
H  4.333746 -4.130428 -0.371244
H  2.612177 -4.41597 -0.758557
H  3.564762 -3.260929 -1.730857
H  -5.730224 -1.748503 -0.359327
H  -5.143363 -0.108041 -0.759173
H  -4.592402 -1.509737 -1.717568
