program: Gaussian 09
title: 000069256
version: EM64L-G09RevD.01
frameworkgroup: C1[X(C7H7NO4)]
method: RPBEPBE
basis: SDD
operation: Freq
keyword: #pfreq=noraman
keyword: PBEPBE/SDD
title: #p freq=noraman PBEPBE/SDD
converged: YES YES NO NO
title: Mulliken charges:
elementType: O O O O N C C C C C C C H H H H H H H
charge: -0.431167 -0.488070 -0.465377 -0.275926 -0.643443 0.432639 -0.504266 -0.545354 0.247728 0.242606 -0.023291 0.147590 0.191529 0.304236 0.400528 0.384914 0.373868 0.313079 0.338178
chargesum: 0.00000
title: Mulliken charges with hydrogens summed into heavy atoms:
elementType: O O O O N C C C C C C C
charge: -0.046253 -0.114202 -0.064850 -0.275926 0.007813 0.432639 -0.312736 -0.241118 0.247728 0.242606 -0.023291 0.147590
polarizability: 1.42764430e+02 1.86657648e+00 1.15929920e+02 -8.15701908e-03 7.27536730e-02 3.98727390e+01
1716.lowfreq: -52.9811 -10.9995 -4.0928 -0.0008 -0.0007 0.0001 5.4957 109.5370 168.3321
frequency: -52.9712 109.5331 168.3319 179.9372 227.4806 237.9453 259.1628 281.3059 322.4520 338.6982 394.7460 416.3013 440.6035 475.7204 503.0105 520.5834 539.5417 558.1455 591.4987 607.6843 623.8898 715.5322 730.4547 751.7316 797.4957 916.3827 920.3444 984.2330 1047.1142 1077.7154 1119.3548 1165.6571 1215.0740 1234.5101 1274.0193 1322.0857 1371.7339 1422.8526 1467.8580 1525.5873 1573.8770 1619.8306 1626.5360 1641.5192 3124.2898 3183.6774 3529.3726 3537.0720 3557.2769 3627.8400 3690.8023
redmass: 4.1436 6.9630 7.8925 6.1031 1.1833 3.1382 5.0261 5.3597 6.1704 6.9257 5.2356 1.2990 1.1160 1.1031 6.2498 1.9598 6.8997 4.3471 4.1563 1.6742 4.0835 2.1355 6.5518 5.6942 2.4701 6.9722 1.4717 4.5204 1.9867 2.0466 1.3078 1.3560 1.4000 3.3310 1.7139 2.2794 5.4730 6.3647 3.9367 3.6755 2.8853 4.7395 2.5620 3.7029 1.0908 1.0922 1.0652 1.0449 1.0653 1.0667 1.1035
irintensity: 11.9877 0.1149 2.0417 3.6149 153.6713 7.1014 1.0406 14.0302 0.1831 2.3332 16.4865 78.3521 217.4353 124.1784 6.0753 93.6392 3.0539 13.9865 58.5366 66.3237 1.0345 44.6464 48.2015 26.6886 10.3852 4.9697 26.1362 195.5805 9.0390 55.8491 59.9913 100.2953 177.7856 44.5743 176.6447 273.0770 242.8070 15.2881 15.8843 81.3430 166.7378 124.1829 173.7749 30.7384 14.2577 6.3318 79.5487 37.2309 110.2496 52.8083 27.7526
temp: 298.150 k
press: 1.00000 atm
elementType: 8 8 8 8 7 6 6 6 6 6 6 6 1 1 1 1 1 1 1
symmnumber: 1
zpe: 356298.2 jmol-1
zpe.correction: 0.135707 hartree
zpe.thermalcorrener: 0.146282 hartree
zpe.thermalcorrenthalpy: 0.147226 hartree
zpe.thermalcorrgfe: 0.100346 hartree
zpe.sumelectzpe: -625.720810 hartree
zpe.sumelectthermal: -625.710235 hartree
zpe.sumelectthermalent: -625.709291 hartree
zpe.sumelectthermalfe: -625.756170 hartree
dipole: -1.5801 7.0833 0.0405
dipole: 7.2575
quadrupole: -64.1871 -61.2240 -72.7728
quadrupole: 11.0832 0.1776 0.0006
quadrupole: 1.8742 4.8373 -6.7115 11.0832 0.1776 0.0006
hfenergy: -625.8565165 hartree
pointgroup: C01 [X(C7H7N1O4)]
dipole: 0.6138109 2.7885075 -0.0160553 debye
dipolederiv: -0.5670124 0.6281497 0.0011818 0.6422922 -0.9748776 -0.0017085 0.0013658 -0.001816 -0.4156132 -0.4868681 -0.5507419 -0.001434 -0.5899939 -1.0599923 -0.0008919 -0.0012793 -0.0008949 -0.4396909 -1.5411536 -0.1065426 0.0011788 -0.0912719 -0.1637558 0.0005527 0.0013466 0.0007409 -0.4120558 -0.9269717 -0.2686177 0.0027352 -0.1843502 -0.8872907 0.0067299 0.0004805 0.0055173 -0.3722228 -0.8035787 0.4613535 -0.006272 0.5155143 -0.7950808 -0.0012046 -0.0062025 -0.0023056 -0.7104459 -0.6575674 0.001325 0.0005827 -0.0479265 0.1690856 0.0015061 0.0020232 0.0010829 0.0380835 -0.0940416 -0.1493733 -0.0008714 0.0690465 -0.2107684 0.0010472 -0.0033165 0.001548 -0.2468878 -0.0989018 0.2443998 0.0001334 -0.0701604 -0.1334705 0.000273 0.0009808 -0.0011805 -0.1632794 0.3849469 -0.5836192 -0.0012365 -0.8124403 0.9722285 0.0024275 -0.0018127 0.0022007 0.0856675 0.1459426 0.3739735 0.0009878 0.6872188 1.0222974 0.0014982 0.0014755 0.0022333 0.0813421 1.2718896 0.1202842 -0.0013752 0.0954969 -0.3892797 -0.0009034 -0.0015584 -0.0011746 -0.0101388 1.8432175 -0.1527508 0.0018892 -0.2323879 1.3493831 -0.0139424 0.0037939 -0.0114462 0.236767 0.0354016 0.0897652 0.0003784 0.0899321 -0.0910887 -0.0011727 0.0011722 -0.0012601 0.1780255 0.1520068 -0.0483113 -0.0001093 -0.0094203 0.0648939 -0.0003231 -0.0006208 0.0002496 0.1751975 0.474709 0.0240348 -0.000061 0.056788 0.187887 -0.0004807 -0.0001294 -0.0004696 0.4104579 0.2546157 -0.1554325 -0.0000846 -0.155474 0.3388379 0.000105 -0.0001682 0.0001312 0.3954816 0.1837007 0.1759818 0.0007259 0.1298231 0.3220913 -0.0003958 0.0005615 -0.0004274 0.4060629 0.2308736 -0.0798168 0.0014279 -0.074655 0.1046824 0.0040539 0.0016746 0.0046143 0.3789486 0.1987913 -0.0240613 0.0002229 -0.0180314 0.1742175 0.0028298 0.0002132 0.0026569 0.3843005 unknown
polarizability: 142.7746657|-1.791033|115.9196368|-0.0806033|-0.0630808|39.8727863 unknown
InChI: InChI=1S/C7H7NO4/c8-7(12)3-1-4(9)6(11)5(10)2-3/h1-2,9-11H,8H2
charge 0 multiplicity 1
19 atoms
O  1.780524 -2.383332 -0.004647
O  1.875606 2.408001 0.004574
O  3.164636 0.000531 -0.002527
O  -3.148099 -1.215095 0.01587
N  -3.30237 1.087012 -0.008175
C  -1.058788 0.02667 0.002897
C  -0.362186 1.268067 0.004404
C  -0.337933 -1.191859 0.000248
C  1.068299 -1.183449 -0.001742
C  1.044774 1.262641 0.002688
C  1.762925 0.048842 -0.000723
C  -2.562612 -0.088096 0.004693
H  -0.887549 2.23033 0.009458
H  -0.890553 -2.134738 -0.000006
H  3.529517 0.922706 -0.001022
H  2.754713 -2.188093 -0.005454
H  1.355319 3.246041 0.007622
H  -2.8925 2.016577 -0.023999
H  -4.317221 0.995844 -0.006856
