program: Gaussian 09
title: 000069237
version: EM64L-G09RevD.01
frameworkgroup: C1[X(C4H6Br2O2)]
method: RPBEPBE
basis: SDD
operation: Freq
keyword: #p
keyword: freq=noraman
keyword: PBEPBE/SDD
title: #p freq=noraman PBEPBE/SDD
converged: NO YES NO NO
title: Mulliken charges:
elementType: Br Br O O C C C C H H H H H H
charge: 0.103707 0.103277 -0.258507 -0.186054 -0.226168 -0.668696 0.422113 -0.824818 0.239167 0.239244 0.218146 0.234138 0.234071 0.370381
chargesum: 0.00000
title: Mulliken charges with hydrogens summed into heavy atoms:
elementType: Br Br O O C C C C
charge: 0.103707 0.103277 -0.258507 -0.186054 0.252243 0.017658 0.422113 -0.454437
polarizability: 9.57680004e+01 -1.54455724e-01 9.19944006e+01 3.54575156e+00 -1.45417226e-02 5.72269123e+01
1716.lowfreq: -25.5177 -9.9224 -6.5051 -1.3863 -0.0004 -0.0004 0.0004 35.1129 102.2087
frequency: -21.3452 34.2562 102.2053 119.7278 142.7536 178.2773 213.9416 256.2652 287.6729 366.3875 549.1563 636.1757 670.9407 727.1783 796.8881 810.0186 925.3487 1021.7349 1081.0782 1115.4682 1134.9631 1163.1737 1243.0667 1249.8283 1355.4758 1400.8864 1463.8730 1472.2238 1484.2486 1654.1666 2998.4808 3013.0999 3073.1235 3094.3823 3113.2752 3153.0073
redmass: 3.3462 3.6265 5.1173 4.8999 15.1715 2.7233 13.5036 1.4468 7.0057 3.4528 10.2647 5.4020 8.5387 9.3299 1.1054 3.8231 6.0340 2.3301 2.6518 2.2175 1.4666 1.0604 1.7002 1.1329 1.3586 1.2589 1.0399 1.0629 1.0665 10.7688 1.0360 1.0582 1.1070 1.0982 1.1028 1.0881
irintensity: 0.0445 1.0284 0.1481 1.1204 0.3211 2.9416 0.1421 1.1063 11.8203 4.8239 133.9008 8.4587 8.4327 23.4042 4.9963 7.2562 23.6518 69.7757 328.2943 9.2548 7.4450 29.1689 99.3920 0.5883 3.7315 24.8220 13.1050 5.0273 14.9150 165.8081 17.0774 13.0791 6.5802 23.7582 36.6187 0.3275
temp: 298.150 k
press: 1.00000 atm
elementType: 35 35 8 8 6 6 6 6 1 1 1 1 1 1
symmnumber: 1
zpe: 251830.4 jmol-1
zpe.correction: 0.095917 hartree
zpe.thermalcorrener: 0.105045 hartree
zpe.thermalcorrenthalpy: 0.105989 hartree
zpe.thermalcorrgfe: 0.058426 hartree
zpe.sumelectzpe: -332.743954 hartree
zpe.sumelectthermal: -332.734827 hartree
zpe.sumelectthermalent: -332.733883 hartree
zpe.sumelectthermalfe: -332.781445 hartree
dipole: -3.2691 0.0005 -1.8947
dipole: 3.7785
quadrupole: -52.9029 -64.8157 -70.6802
quadrupole: 0.0259 -0.0742 0.0688
quadrupole: 9.8967 -2.0161 -7.8806 0.0259 -0.0742 0.0688
hfenergy: -332.8398714 hartree
pointgroup: C01 [X(C4H6Br2O2)]
dipole: -1.3299688 0.010741 0.6640636 debye
dipolederiv: -0.203133 -0.2878443 -0.0344108 -0.1729064 -0.5787627 0.012741 -0.0129946 0.054266 -0.0386482 -0.1968249 0.2798725 -0.0418425 0.1659135 -0.5882653 0.0005975 -0.0186797 -0.0411728 -0.0385167 -1.6948493 0.0054012 0.265799 0.0033762 -0.270053 -0.0022241 0.1836942 -0.0029658 -0.5808412 -0.634644 0.0010419 -0.0715931 0.0020646 -0.2623047 -0.0035594 0.1895726 -0.0030257 -0.8641879 0.9731636 -0.0016866 -0.0201073 0.0008462 0.3709871 -0.0010774 0.1662626 -0.0011854 0.2360094 -0.1416303 0.0005259 0.0695257 0.0001835 0.0593066 -0.0001034 0.0408003 0.0001125 0.0058125 1.6747856 -0.0082017 -0.1525507 -0.0082262 0.0305716 0.0070885 -0.2739604 0.0069367 1.2034969 0.2157095 0.0104736 -0.0389624 0.0103631 1.4151143 -0.0152614 -0.1488728 -0.0152913 -0.0375213 -0.0548571 -0.0436874 0.0321256 -0.0029554 -0.0468092 0.0986988 -0.05084 0.0789361 0.0078615 -0.0542876 0.0444639 0.0315283 0.0024947 -0.048192 -0.0980745 -0.0507763 -0.0781009 0.009254 -0.1191005 -0.0000464 -0.0762045 -0.0002003 0.1193459 -0.0003218 -0.0911091 -0.0003602 0.0315959 0.1147985 0.0313751 -0.0115947 0.0025912 -0.0552709 0.1141651 0.0444113 0.0989758 0.0131158 0.1146915 -0.031667 -0.011399 -0.002341 -0.0569019 -0.113695 0.0443957 -0.0986421 0.0146784 0.0061779 -0.0000206 0.0596865 -0.0012036 -0.0887659 0.0010263 -0.0219039 0.0015172 0.0378909 unknown
polarizability: 96.0591465|0.13458|91.986714|-1.1329148|-0.5083174|56.9434529 unknown
InChI: InChI=1S/C4H6Br2O2/c1-2-8-4(7)3(5)6/h3H,2H2,1H3
charge 0 multiplicity 1
14 atoms
Br 2.4834 1.65106 0.330536
Br 2.455435 -1.675732 0.370119
O  -0.966658 0.004871 0.400097
O  0.241342 -0.009369 -1.603919
C  -2.251794 0.002419 -0.376227
C  -3.385172 0.006796 0.641268
C  0.198908 -0.002151 -0.359313
C  1.381795 0.000277 0.60978
H  -2.254391 0.89528 -1.027294
H  -2.255361 -0.895351 -1.020507
H  -4.355765 0.005154 0.112254
H  -3.341017 -0.886762 1.286218
H  -3.340358 0.905122 1.279512
H  1.049036 0.014685 1.653976
