program: Gaussian 09
title: 000069233
version: EM64L-G09RevD.01
frameworkgroup: C1[X(C15H14O3)]
method: RPBEPBE
basis: SDD
operation: Freq
keyword: #pfreq=noraman
keyword: PBEPBE/SDD
title: #p freq=noraman PBEPBE/SDD
converged: YES YES NO NO
title: Mulliken charges:
elementType: O O O C C C C C C C C C C C C C C C H H H H H H H H H H H H H H
charge: -0.275995 -0.275867 -0.214408 0.345743 0.345936 0.233400 0.232639 -0.378953 -0.378419 -0.345593 -0.345684 -0.814986 -0.814975 -0.231867 -0.231926 -0.216240 -0.216259 0.233266 0.234491 0.234497 0.254139 0.254240 0.259857 0.236299 0.227154 0.260007 0.227194 0.236204 0.229674 0.229679 0.233363 0.233388
chargesum: 0.00000
title: Mulliken charges with hydrogens summed into heavy atoms:
elementType: O O O C C C C C C C C C C C C C C C
charge: -0.275995 -0.275867 -0.214408 0.345743 0.345936 0.233400 0.232639 -0.144463 -0.143922 -0.091454 -0.091443 -0.091676 -0.091570 -0.002192 -0.002247 0.017123 0.017129 0.233266
polarizability: 2.35471179e+02 4.19359318e-02 1.73858934e+02 -4.14715555e-02 -3.55369492e+00 9.17004694e+01
1716.lowfreq: -15.3404 -5.2944 0.0006 0.0007 0.0009 6.3370 18.0650 31.6687 46.0559
frequency: 17.8720 31.6487 45.7651 72.1761 78.7129 110.2731 130.6732 149.1921 174.5930 194.3931 208.0676 275.5033 286.6992 294.1803 294.4219 410.4858 428.0672 445.0870 446.5894 504.6644 515.4152 526.3737 542.3125 565.9523 634.3721 656.7317 681.5036 708.2467 720.2589 721.9693 750.9025 774.0479 775.1810 815.7822 829.7945 864.0895 865.6044 933.8019 944.9731 947.3370 985.1575 985.3817 985.4503 986.2072 1039.5839 1040.3681 1047.6213 1051.1820 1086.2601 1108.8971 1123.7624 1161.2831 1170.3222 1170.7637 1178.4280 1223.2176 1229.9804 1280.1656 1281.0550 1377.7302 1378.7874 1392.9365 1398.9133 1432.2325 1433.4052 1463.3377 1465.2693 1475.3679 1479.4333 1480.8932 1490.9431 1588.0342 1588.8453 1620.2025 1620.3068 1655.9040 2980.9925 2982.7478 3062.6677 3063.4777 3093.5154 3094.7396 3126.9867 3127.0414 3141.9776 3141.9926 3157.7868 3157.9209 3173.5905 3173.6945
redmass: 3.6401 4.8952 6.0400 4.9975 8.0196 4.7132 1.0725 1.1555 2.5626 3.3654 6.0265 4.1912 4.0944 4.4214 4.0082 4.5671 3.7371 2.9960 2.9083 5.9201 4.1681 3.7113 5.8219 6.3115 6.9066 6.0903 12.0102 3.4362 2.7836 3.8834 1.6467 1.5824 2.7914 4.9696 4.7012 1.3308 1.3975 4.5674 1.3791 1.5631 1.6009 1.3291 1.3234 1.6515 2.0114 1.9980 1.5383 1.5321 3.3012 1.8917 4.3947 2.1873 1.0933 1.0725 2.4545 2.5817 2.7807 1.4753 1.4762 6.7392 7.7765 1.2464 1.2313 2.1513 2.2320 1.0790 1.0919 1.3700 2.2627 1.8733 1.1908 5.8572 6.1571 7.4121 7.4531 11.6306 1.0373 1.0369 1.0973 1.0973 1.0992 1.0991 1.0870 1.0870 1.0896 1.0896 1.0946 1.0946 1.1002 1.1002
irintensity: 0.0060 0.6828 0.8017 0.0326 0.7175 1.2646 0.0475 2.4619 1.9215 4.8026 2.4035 4.2686 1.8468 2.4825 3.6318 0.4417 1.7679 0.0109 15.1727 10.5783 0.0095 1.2778 0.6014 1.0185 0.8480 1.3284 13.8011 7.8062 12.1303 7.9042 81.9441 26.4359 47.0641 0.2870 26.5164 0.7974 2.7950 3.1702 0.8719 6.5937 2.9902 0.1034 0.1454 0.3377 2.5317 6.6127 3.6503 13.7019 553.4418 10.0740 1139.8959 23.4875 0.0284 1.9681 2.9875 18.3414 0.3899 2.3635 0.1971 1.3750 2.6921 7.7613 16.8177 8.1019 1.1270 0.4135 42.1556 1.7375 23.6369 138.3057 12.5671 5.2599 14.5496 2.6249 3.6067 178.6537 11.6532 28.7810 0.7854 21.5170 28.0811 18.6361 1.5666 7.8675 0.0740 22.1140 41.5841 8.2585 14.2285 10.9192
temp: 298.150 k
press: 1.00000 atm
elementType: 8 8 8 6 6 6 6 6 6 6 6 6 6 6 6 6 6 6 1 1 1 1 1 1 1 1 1 1 1 1 1 1
symmnumber: 1
zpe: 653941.5 jmol-1
zpe.correction: 0.249073 hartree
zpe.thermalcorrener: 0.265682 hartree
zpe.thermalcorrenthalpy: 0.266626 hartree
zpe.thermalcorrgfe: 0.202869 hartree
zpe.sumelectzpe: -804.384409 hartree
zpe.sumelectthermal: -804.367800 hartree
zpe.sumelectthermalent: -804.366856 hartree
zpe.sumelectthermalfe: -804.430613 hartree
dipole: -0.0032 0.8781 -0.1555
dipole: 0.8917
quadrupole: -83.4651 -90.2086 -114.9467
quadrupole: 0.0065 -0.0021 1.0384
quadrupole: 12.7417 5.9982 -18.7399 0.0065 -0.0021 1.0384
hfenergy: -804.6334818 hartree
pointgroup: C01 [X(C15H14O3)]
dipole: 0.0013809 -0.3352678 -0.1033215 debye
polarizability: 235.4711027|0.0478247|171.7385853|0.0969632|13.503337|93.8208948 unknown
InChI: InChI=1S/C15H14O3/c1-11-7-3-5-9-13(11)17-15(16)18-14-10-6-4-8-12(14)2/h3-10H,1-2H3
charge 0 multiplicity 1
32 atoms
O  -1.108944 0.423032 0.937692
O  1.104708 0.425292 0.938387
O  -0.001132 0.049307 -1.115048
C  -2.933641 -0.918138 -0.07455
C  2.928904 -0.916457 -0.075478
C  -2.420264 0.333922 0.343629
C  2.417006 0.335185 0.345655
C  -4.266304 -0.924632 -0.559999
C  4.262084 -0.923345 -0.559671
C  -3.172105 1.521991 0.310225
C  3.170572 1.522287 0.316795
C  -2.107048 -2.185862 -0.009364
C  2.100814 -2.183403 -0.014939
C  -5.041329 0.255334 -0.618027
C  5.038831 0.255629 -0.613394
C  -4.496216 1.48321 -0.178259
C  4.495109 1.482994 -0.170404
C  -0.001547 0.270864 0.107843
H  -4.698153 -1.875823 -0.892794
H  4.69291 -1.87421 -0.894723
H  -2.71849 2.452146 0.665762
H  2.717784 2.451964 0.67459
H  -1.360444 -2.206133 -0.825307
H  -1.556181 -2.260229 0.945876
H  -2.747303 -3.077933 -0.110024
H  1.360463 -2.203947 -0.836567
H  2.741109 -3.076115 -0.109654
H  1.542635 -2.256331 0.936127
H  -6.067964 0.214858 -0.997634
H  6.065782 0.214855 -0.99212
H  -5.092244 2.401016 -0.21266
H  5.092598 2.399971 -0.201367
