program: Gaussian 09
title: 000074229
version: EM64L-G09RevD.01
frameworkgroup: C1[X(C11H15NO2)]
method: RPBEPBE
basis: SDD
operation: Freq
keyword: #p
keyword: freq=noraman
keyword: PBEPBE/SDD
title: #p freq=noraman PBEPBE/SDD
converged: YES YES NO NO
title: Mulliken charges:
elementType: O O N C C C C C C C C C C C H H H H H H H H H H H H H H H
charge: -0.192489 -0.381993 -0.084640 -0.369056 -0.525996 0.125988 0.192025 -0.621266 -0.614946 0.180343 -0.305767 -0.406759 -0.282874 -0.195855 0.245308 0.190017 0.244886 0.240724 0.227879 0.186603 0.219897 0.218017 0.187576 0.229583 0.252382 0.219289 0.233158 0.232987 0.354977
chargesum: 0.00000
title: Mulliken charges with hydrogens summed into heavy atoms:
elementType: O O N C C C C C C C C C C C
charge: -0.192489 -0.027015 -0.084640 0.066270 -0.040385 0.125988 0.192025 0.013114 0.020229 0.180343 -0.053384 -0.187470 -0.049716 0.037131
polarizability: 1.82445822e+02 7.72474773e+00 1.41835386e+02 -6.38778048e+00 5.22972518e+00 7.76219042e+01
1716.lowfreq: -0.0008 -0.0001 0.0004 4.3514 7.0244 11.3909 23.8899 39.8041 61.2555
frequency: 23.2474 39.3048 61.2350 79.9877 104.2234 135.9093 200.6122 207.8977 227.9372 239.1665 251.8213 303.3908 339.4203 380.8001 403.8294 417.3475 426.8245 451.1431 497.1998 515.5571 554.3623 581.7854 640.3131 729.4914 735.9026 755.1247 801.4799 810.4567 841.6358 851.9379 942.4900 963.5959 978.4117 1027.5938 1031.8823 1035.4168 1046.3409 1079.1006 1091.6666 1102.3623 1127.7644 1159.0305 1164.3247 1176.9146 1198.0223 1227.3966 1252.8309 1265.2542 1289.7201 1297.2381 1308.6272 1371.7128 1394.2148 1418.8225 1425.8296 1438.0325 1443.4751 1462.1177 1465.2414 1474.2543 1477.1985 1485.7960 1490.3526 1572.5806 1607.5107 1608.4720 2843.3121 2851.2756 2867.7355 2972.5072 3019.5912 3024.7615 3031.1202 3057.9984 3078.3820 3082.1620 3110.5532 3141.5418 3157.0195 3174.6699 3539.0322
redmass: 6.0866 2.7621 3.5837 3.9046 2.6732 2.6190 3.4165 3.1073 1.4037 2.4478 1.3297 4.2706 2.2914 5.2442 1.6014 2.4225 2.1733 2.6718 3.1695 3.5554 6.7897 2.6543 6.3040 3.1650 4.0254 1.4019 1.5324 5.6888 2.2168 2.0326 1.3710 4.7939 1.3317 1.8327 1.8883 2.0158 2.2370 1.9914 1.4943 1.9900 1.3149 1.5749 1.2938 1.0767 1.8357 2.3966 2.7945 2.7374 1.6054 1.2706 1.6422 1.4344 6.8245 1.1436 1.9791 1.1927 1.1572 1.0515 1.0737 1.0674 1.0597 1.0640 2.3210 7.0129 6.7782 7.0943 1.0576 1.0646 1.0632 1.0604 1.0724 1.0744 1.0919 1.0905 1.1008 1.1005 1.0889 1.0881 1.0929 1.0990 1.0657
irintensity: 2.9978 0.8968 0.9283 2.7991 0.2538 2.5789 2.0765 0.6946 1.4522 2.0816 3.9407 6.9256 7.2958 16.3857 80.7941 17.0837 27.3689 4.9736 13.1565 7.2396 4.0711 0.5109 19.2988 9.9502 14.8083 93.7944 1.3145 14.3671 10.6431 13.8733 1.6987 66.7371 0.1582 5.5682 8.9513 28.5743 2.2894 32.7244 63.6822 61.9155 6.9256 15.9359 25.7859 6.1006 51.3614 121.4599 18.8601 1.3280 68.5639 14.0845 86.7721 26.5482 13.8288 1.9326 16.8407 26.0567 3.0244 17.7642 1.2930 6.0730 19.0325 24.8361 9.6448 109.3802 19.5876 112.2242 77.1633 66.6335 210.1337 25.2718 42.9181 43.8239 10.8929 18.4179 26.0529 64.4046 14.1320 5.2273 20.4408 14.4654 25.2812
temp: 298.150 k
press: 1.00000 atm
elementType: 8 8 7 6 6 6 6 6 6 6 6 6 6 6 1 1 1 1 1 1 1 1 1 1 1 1 1 1 1
symmnumber: 1
zpe: 624825.1 jmol-1
zpe.correction: 0.237983 hartree
zpe.thermalcorrener: 0.252525 hartree
zpe.thermalcorrenthalpy: 0.253469 hartree
zpe.thermalcorrgfe: 0.195209 hartree
zpe.sumelectzpe: -632.271903 hartree
zpe.sumelectthermal: -632.257361 hartree
zpe.sumelectthermalent: -632.256417 hartree
zpe.sumelectthermalfe: -632.314677 hartree
dipole: -2.5167 -2.4589 1.3568
dipole: 3.7711
quadrupole: -60.4160 -84.1868 -86.8825
quadrupole: -2.9756 -0.4637 1.9730
quadrupole: 16.7458 -7.0250 -9.7208 -2.9756 -0.4637 1.9730
hfenergy: -632.5098861 hartree
pointgroup: C01 [X(C11H15N1O2)]
dipole: -1.0117977 -0.8747771 0.6420858 debye
polarizability: 182.7775077|6.0204683|141.8754267|-6.9726586|-2.3445269|77.2501774 unknown
InChI: InChI=1S/C11H15NO2/c1-12(2)8-7-11(14)9-5-3-4-6-10(9)13/h3-6,13H,7-8H2,1-2H3
charge 0 multiplicity 1
29 atoms
O  0.311528 1.872502 -0.699212
O  -2.289267 2.256912 0.035787
N  3.833922 -0.427168 -0.261722
C  2.668178 0.484111 -0.155565
C  1.332033 -0.278353 -0.185005
C  0.128459 0.659899 -0.392822
C  -1.245706 0.068901 -0.235553
C  4.012742 -1.287274 0.926282
C  5.073192 0.311225 -0.585153
C  -2.419417 0.870937 -0.058156
C  -1.424142 -1.343604 -0.284657
C  -3.69751 0.263328 0.050505
C  -2.690693 -1.949543 -0.184817
C  -3.835532 -1.135762 -0.016801
H  2.688259 1.177127 -1.014537
H  2.714177 1.122204 0.763945
H  1.379856 -1.007642 -1.020287
H  1.176971 -0.867209 0.739056
H  3.128955 -1.931866 1.073351
H  4.177304 -0.704306 1.86969
H  4.886177 -1.946568 0.775363
H  5.901271 -0.403177 -0.743227
H  5.385759 1.029456 0.215614
H  4.930968 0.883132 -1.519023
H  -0.545733 -1.980824 -0.421774
H  -4.584854 0.895969 0.188219
H  -2.787542 -3.038247 -0.238974
H  -4.830237 -1.587219 0.063908
H  -3.175419 2.674059 0.192867
