program: Gaussian 09
title: 000069228
version: EM64L-G09RevD.01
frameworkgroup: C1[X(C6H5NO6S)]
method: RPBEPBE
basis: SDD
operation: Freq
keyword: #p
keyword: freq=noraman
keyword: PBEPBE/SDD
title: #p freq=noraman PBEPBE/SDD
converged: YES YES NO NO
title: Mulliken charges:
elementType: S O O O O O O N C C C C C C H H H H H
charge: 1.002832 -0.564149 -0.362142 -0.487141 -0.491471 -0.159621 -0.255573 0.034320 -0.055945 -0.340032 0.309910 -0.191866 0.158233 -0.275720 0.333465 0.293963 0.283439 0.389541 0.377956
chargesum: 0.00000
title: Mulliken charges with hydrogens summed into heavy atoms:
elementType: S O O O O O O N C C C C C C
charge: 1.002832 -0.174608 0.015814 -0.487141 -0.491471 -0.159621 -0.255573 0.034320 -0.055945 -0.006567 0.309910 0.102097 0.158233 0.007719
polarizability: 1.75388933e+02 2.71560471e+00 1.36486094e+02 -1.15663540e+00 2.02077858e-01 6.46107017e+01
1716.lowfreq: -7.6390 -0.0014 0.0012 0.0015 1.4894 3.6145 28.0190 68.4458 104.1306
frequency: 28.0107 68.4436 104.1281 107.0629 148.6994 178.7787 192.5554 214.4550 242.1662 293.1456 302.5215 339.9981 367.9441 391.8987 417.8713 419.8381 430.1915 526.2192 540.3114 566.0082 619.2007 671.1775 679.3471 732.0612 768.7648 827.9416 837.0154 849.2504 857.7982 936.9084 971.9413 984.4640 1047.5463 1058.5558 1065.6094 1138.8550 1155.0205 1213.5844 1261.5392 1306.4129 1364.1872 1423.8643 1441.4053 1485.0975 1574.0614 1617.7589 2976.8587 3163.5480 3166.4648 3190.5892 3479.6770
redmass: 9.0173 9.0532 10.1158 10.3029 5.1314 2.8112 4.5094 5.4542 3.8870 3.8779 9.2955 7.7627 7.6825 9.0339 11.0505 9.8571 3.7431 6.1075 5.5138 6.0189 8.3022 9.1268 7.3332 4.6582 8.1095 9.8684 1.3837 8.5565 1.1270 1.4100 14.6863 1.3722 1.3515 1.6381 5.1246 1.4272 6.7157 1.4231 2.6302 2.1297 6.2688 7.9338 2.3227 3.5353 5.7760 6.6858 1.0657 1.0908 1.0930 1.0965 1.0662
irintensity: 1.8006 0.4320 1.2283 0.5843 2.4237 23.6534 15.8702 12.4985 35.4894 54.5850 10.0122 23.1868 0.7516 21.5731 50.1470 26.6944 0.7551 52.2310 2.6415 125.1184 28.0481 8.2674 1.0445 2.3215 5.8798 54.9831 123.2746 42.4598 51.4278 17.6275 78.5482 1.1358 45.3740 102.8339 34.0249 27.6179 237.3840 74.4631 182.8125 73.8453 90.2088 16.1546 74.0210 42.8410 64.1612 97.4418 208.5747 4.2447 18.9619 0.8098 53.4725
temp: 298.150 k
press: 1.00000 atm
elementType: 16 8 8 8 8 8 8 7 6 6 6 6 6 6 1 1 1 1 1
symmnumber: 1
zpe: 297551.7 jmol-1
zpe.correction: 0.113331 hartree
zpe.thermalcorrener: 0.126644 hartree
zpe.thermalcorrenthalpy: 0.127588 hartree
zpe.thermalcorrgfe: 0.072574 hartree
zpe.sumelectzpe: -1134.497287 hartree
zpe.sumelectthermal: -1134.483974 hartree
zpe.sumelectthermalent: -1134.483030 hartree
zpe.sumelectthermalfe: -1134.538044 hartree
dipole: -0.1966 2.8130 1.4602
dipole: 3.1755
quadrupole: -98.1575 -92.3783 -89.4438
quadrupole: -5.0201 9.2075 -2.0277
quadrupole: -4.8310 0.9482 3.8827 -5.0201 9.2075 -2.0277
hfenergy: -1134.610618 hartree
pointgroup: C01 [X(C6H5N1O6S1)]
dipole: -0.0332546 1.094167 0.6020935 debye
dipolederiv: 2.0880845 -0.1581095 0.0753551 -0.3676322 1.2166557 -0.0379753 0.1819457 -0.0661058 1.6427405 -0.5683623 -0.0359025 -0.2244282 0.0153046 -0.5271793 0.0865543 -0.3127938 0.09287 -0.9784319 -1.2018099 0.4043601 0.0176975 0.2391123 -0.5021789 -0.0068578 0.0182025 -0.0103328 -0.362322 -0.6453861 0.0507624 -0.0217005 0.1389705 -0.5850304 -0.110968 -0.0037001 -0.027192 -0.5004045 -0.7435514 -0.0223933 0.0533209 -0.0177532 -0.5346173 0.101785 0.0049948 0.0251996 -0.5015718 -0.4001546 0.0145102 0.0011616 -0.173778 -0.9032893 -0.0267745 -0.0030686 -0.0239615 -0.1917234 -0.9607407 0.0344411 0.0046691 0.1068939 -0.4703411 -0.0088987 0.0176698 -0.0070811 -0.264532 1.4748885 0.3616526 0.0037353 0.5023567 1.4238324 0.044214 -0.0016496 0.0356999 0.2192375 -0.3192388 -0.2006615 0.0072766 -0.1797169 -0.4393517 -0.0118544 0.1520148 -0.0326551 -0.1771719 0.3855781 0.3212883 0.0050709 0.1761682 -0.0989454 -0.0040108 -0.0031491 0.0000842 -0.0087971 -0.7173114 -0.428037 -0.0119842 -0.1768639 -0.5218491 -0.018116 -0.016278 -0.0128439 0.0175606 -0.0216467 -0.0406125 -0.0036535 -0.1463035 0.3317336 0.0161059 -0.0164021 0.0016563 -0.0401137 1.1686187 -0.5136 -0.0266279 -0.0495946 0.4220781 0.0097232 -0.0150934 0.0167052 0.150998 -0.4868128 0.1723725 0.0024291 -0.1060198 0.1463463 0.0132527 -0.0124038 0.0147758 -0.1483249 0.1819453 -0.009257 0.0078245 0.0174077 0.1339822 -0.0017443 0.0063394 -0.0091933 0.1645626 0.1027619 -0.0647969 0.0038801 -0.0275314 0.128248 -0.0054532 0.0067801 0.0056872 0.1525867 0.0560064 0.0400172 0.0028153 0.0119231 0.0191857 -0.0045499 0.0079303 -0.0062653 0.176033 0.1435258 0.0793816 0.1024438 0.0787621 0.3274861 -0.0374048 -0.0082801 0.0004425 0.2744959 0.4636054 -0.0054159 0.0007145 -0.0417057 0.4332346 0.0029726 -0.0030588 0.0025098 0.3751784 unknown
polarizability: 175.5679827|0.8963149|136.2585103|0.2645519|2.0879502|64.6592356 unknown
InChI: InChI=1S/C6H5NO6S/c8-6-2-1-4(14(11,12)13)3-5(6)7(9)10/h1-3,8,11H
charge 0 multiplicity 1
19 atoms
S  2.73564 -0.427895 -0.092704
O  2.945944 -0.527041 1.748211
O  -2.872837 1.779619 0.082404
O  2.747076 -1.923037 -0.706004
O  3.714177 0.723502 -0.668396
O  -2.256574 -2.387497 -0.078131
O  -3.709859 -0.633499 0.006911
N  -2.48558 -1.130406 -0.029071
C  0.987754 0.221179 -0.023106
C  -0.056266 -0.698016 -0.040439
C  -1.373772 -0.183333 -0.01034
C  0.797689 1.622626 0.02749
C  -1.623156 1.233112 0.046388
C  -0.509688 2.119519 0.058233
H  0.112808 -1.778458 -0.089974
H  1.661421 2.294889 0.025406
H  -0.713353 3.192367 0.096007
H  3.866903 -0.873197 1.93664
H  -3.550026 1.010966 0.064572
