program: Gaussian 09
title: 000069222
version: EM64L-G09RevD.01
frameworkgroup: C1[X(C4H12N2)]
method: RPBEPBE
basis: SDD
operation: Freq
keyword: #pfreq=noraman
keyword: PBEPBE/SDD
title: #p freq=noraman PBEPBE/SDD
converged: YES YES NO NO
title: Mulliken charges:
elementType: N N C C C C H H H H H H H H H H H H
charge: -0.061084 -0.569970 -0.329572 -0.280796 -0.683079 -0.677716 0.210115 0.172294 0.174171 0.197076 0.204401 0.229683 0.211146 0.214540 0.248489 0.194247 0.300329 0.245726
chargesum: 0.00000
title: Mulliken charges with hydrogens summed into heavy atoms:
elementType: N N C C C C
charge: -0.061084 -0.023915 0.052837 0.090452 -0.037850 -0.020439
polarizability: 6.92124835e+01 -8.77573395e-01 5.89895019e+01 -4.50281926e-01 2.05812731e-01 5.26184457e+01
1716.lowfreq: -5.6777 -0.0005 -0.0005 -0.0004 12.4084 21.4426 88.8033 119.7357 205.7274
frequency: 88.7210 119.7060 205.7244 211.1674 248.1539 331.8043 335.0987 389.7111 413.3262 501.2226 645.5715 744.2784 793.9498 811.5961 939.2473 990.9323 1058.0991 1076.4413 1090.3306 1123.6387 1164.7870 1190.4505 1231.2005 1266.9125 1297.7853 1333.1165 1369.3470 1380.4749 1390.0831 1455.0519 1457.2036 1467.4005 1470.5555 1488.1084 1491.7448 1636.6500 2830.3115 2864.9076 2983.7529 2986.6354 3014.7216 3025.6437 3078.8355 3082.5909 3089.1440 3102.5681 3300.6923 3543.1175
redmass: 2.6225 1.5543 1.8901 1.3117 1.1929 2.6962 1.2230 1.7190 3.2105 1.9472 1.8363 2.5083 1.1389 1.1412 2.4228 1.8252 1.7373 2.2778 2.4512 1.6911 2.1885 2.5623 1.3451 1.1574 1.1798 1.3973 1.2646 1.2728 1.3211 1.0651 1.0559 1.0510 1.0684 1.0564 1.0551 1.0835 1.0709 1.0704 1.0356 1.0359 1.0876 1.0874 1.0985 1.0993 1.1004 1.1000 1.0517 1.0883
irintensity: 0.1819 0.6438 3.2518 0.8641 0.6264 4.2271 39.3337 2.8684 0.3357 40.0859 156.2257 22.6911 1.2890 11.1770 0.3966 17.7279 35.4860 1.2209 1.3839 9.9420 3.6203 2.8648 5.3964 2.2424 3.6284 20.0129 11.7540 27.4687 10.1612 3.1225 13.2540 12.2305 5.2368 5.8725 10.6062 15.4455 79.1061 138.3670 41.5699 31.2873 3.8587 46.9832 46.5030 43.6950 36.8125 30.6988 31.2719 2.6224
temp: 298.150 k
press: 1.00000 atm
elementType: 7 7 6 6 6 6 1 1 1 1 1 1 1 1 1 1 1 1
symmnumber: 1
zpe: 425347.3 jmol-1
zpe.correction: 0.162006 hartree
zpe.thermalcorrener: 0.170200 hartree
zpe.thermalcorrenthalpy: 0.171144 hartree
zpe.thermalcorrgfe: 0.130302 hartree
zpe.sumelectzpe: -268.549230 hartree
zpe.sumelectthermal: -268.541036 hartree
zpe.sumelectthermalent: -268.540092 hartree
zpe.sumelectthermalfe: -268.580934 hartree
dipole: -1.4290 -0.2173 0.9907
dipole: 1.7523
quadrupole: -39.7144 -37.4009 -39.4202
quadrupole: -2.4741 -0.0900 0.0426
quadrupole: -0.8692 1.4443 -0.5750 -2.4741 -0.0900 0.0426
hfenergy: -268.7112363 hartree
pointgroup: C01 [X(C4H12N2)]
dipole: -0.5614047 0.1291084 -0.3787555 debye
dipolederiv: -0.4302447 0.082804 0.0359824 -0.0584408 -0.0471687 0.1109298 -0.000043 0.1628379 -0.4725706 -0.6622095 0.1790833 0.0441079 0.1700167 -0.2658079 0.0611754 0.0694501 -0.0692764 0.0756371 0.3726433 -0.1040003 0.0764087 -0.1719051 0.1181116 -0.0742956 0.0504611 -0.0221269 0.4328697 0.4338821 0.1107687 -0.0622322 0.1978146 0.1916927 -0.0293445 -0.0501916 -0.0197774 0.3993107 -0.1273171 -0.0430549 0.0503203 -0.0136927 0.0522606 0.0126865 0.0365288 0.0349638 0.0334259 -0.1095253 0.0579198 -0.0495122 0.0271085 0.0167944 -0.003169 -0.05085 0.0208222 0.0417631 0.0268264 -0.0327276 -0.0126294 -0.0047425 -0.1693034 -0.0614522 -0.0120537 -0.0792633 0.0473409 -0.0629662 0.0391518 0.033334 0.0327411 0.0230729 -0.0058029 -0.1076204 0.0996328 -0.300904 -0.0635593 -0.0315573 -0.0326895 -0.041852 0.0384408 0.0065706 0.1015282 0.095653 -0.286248 0.0224817 0.0599261 0.0138379 0.0203229 -0.16814 -0.0565452 0.0184998 -0.0799364 0.0468858 0.1043381 -0.0153497 0.003498 -0.0993209 -0.1316688 -0.0688467 -0.0133453 -0.0949013 0.04011 0.1003034 -0.0098096 -0.0426708 -0.0251721 0.0857665 0.0323656 0.0290659 0.0253247 -0.154926 -0.1235686 0.1032831 -0.0263425 0.1352604 0.0154165 0.0330349 -0.0483206 0.0453652 0.0913647 0.0883734 0.0134073 0.0308436 0.018805 0.0885679 -0.0004186 -0.0383562 0.0006419 -0.17748 0.1413856 0.0142735 0.0064307 0.0820953 -0.0885424 -0.0411328 0.0125828 -0.0609859 0.0740069 -0.1551282 -0.1004227 0.0410635 -0.1317906 0.0289419 0.0447587 0.0681876 0.0539842 0.0700254 0.2078061 -0.210143 0.0659369 -0.1050647 0.1444051 0.0013233 0.0614836 -0.0143788 0.1137041 0.2364789 -0.1135524 -0.1756873 -0.032183 0.0671602 0.0381627 -0.1270071 -0.0985793 -0.0743158 unknown
polarizability: 69.2016007|0.85636|58.8567709|0.605673|0.9602614|52.7620596 unknown
InChI: InChI=1S/C4H12N2/c1-3-6(5)4-2/h3-5H2,1-2H3
charge 0 multiplicity 1
18 atoms
N  -0.009413 -0.069169 0.097384
N  0.024435 -1.398657 -0.465554
C  -1.247109 0.682464 -0.264421
C  1.234221 0.668395 -0.272367
C  -2.513276 0.039369 0.324846
C  2.483796 0.022757 0.341249
H  -1.138955 1.709022 0.134071
H  -1.353083 0.772341 -1.378604
H  1.347235 0.731523 -1.384448
H  1.117063 1.703586 0.102419
H  -2.686972 -0.970809 -0.08943
H  -2.421774 -0.046975 1.422213
H  -3.402332 0.65395 0.093499
H  2.425436 0.041048 1.443952
H  2.55371 -1.028356 0.014908
H  3.396996 0.560544 0.024753
H  -0.428041 -2.076818 0.153963
H  -0.318037 -1.453315 -1.443031
