program: Gaussian 09
title: 000074187
version: EM64L-G09RevD.01
frameworkgroup: C1[X(C8H9N3)]
method: RPBEPBE
basis: SDD
operation: Freq
keyword: #p
keyword: freq=noraman
keyword: PBEPBE/SDD
title: #p freq=noraman PBEPBE/SDD
converged: NO YES NO YES
title: Mulliken charges:
elementType: N N N C C C C C C C C H H H H H H H H H
charge: -0.239879 -0.102966 -0.630925 0.340030 0.044497 0.123270 -0.366811 -0.664086 -0.332415 -0.231667 -0.232506 0.218633 0.238662 0.238531 0.250092 0.242635 0.217784 0.219868 0.339969 0.327283
chargesum: 0.00000
title: Mulliken charges with hydrogens summed into heavy atoms:
elementType: N N N C C C C C C C C
charge: -0.239879 -0.102966 0.036328 0.340030 0.044497 0.123270 -0.148178 0.063199 -0.089781 -0.013883 -0.012638
polarizability: 1.60143347e+02 -2.40349180e+00 1.08177477e+02 8.20305279e-03 -1.39857642e-04 4.79750679e+01
1716.lowfreq: -74.7822 -11.8781 -0.0008 -0.0006 -0.0006 6.2982 9.7463 91.6902 137.4072
frequency: -74.7795 91.6890 137.4059 171.6243 250.0544 266.7090 282.8126 332.9605 425.7399 449.3494 492.5866 541.7019 565.7879 580.0306 664.1867 683.0530 713.7499 744.1512 759.2936 845.2876 855.4263 891.8367 918.9618 965.3080 1007.4185 1036.0442 1078.6889 1118.7180 1122.4564 1162.6452 1186.2967 1244.6419 1283.4394 1321.2933 1395.8998 1407.1101 1447.1686 1459.9487 1470.8440 1476.3652 1488.4880 1555.4430 1593.2249 1623.4976 1645.5577 2965.8680 3039.4661 3105.9726 3121.3469 3133.1869 3152.6426 3167.9650 3579.4147 3726.2233
redmass: 1.0759 1.7059 5.2642 1.5007 2.9979 5.3715 3.0658 3.8094 2.2306 1.3544 6.5705 3.4641 5.3774 3.7408 6.2452 7.7272 4.9924 1.3233 3.9265 1.4671 5.3162 3.3210 1.3821 1.2943 2.0667 1.8745 2.9511 1.3055 1.4734 1.1204 2.1575 4.3291 1.6907 3.7902 2.5217 2.5448 2.4329 2.5847 1.8730 1.0410 1.3946 2.6298 2.9795 3.7718 3.1704 1.0368 1.1023 1.0963 1.0860 1.0897 1.0949 1.0988 1.0449 1.1048
irintensity: 25.3956 14.0100 0.0553 118.8680 1.1557 5.8216 4.3073 21.6934 13.5952 147.3724 1.9826 0.8752 5.7778 0.1157 11.1580 0.6857 0.5928 115.3010 3.0513 0.8510 1.9621 2.3505 4.2308 0.2300 15.4400 2.2731 3.7305 0.4281 17.8802 2.4259 15.2311 32.6652 24.7117 17.7355 31.0998 31.3494 41.0610 20.5888 84.8395 13.5379 4.1288 168.9493 27.0195 101.8057 371.3972 70.9866 31.1955 8.3722 3.3672 18.3180 30.6524 19.5225 112.8412 42.6687
temp: 298.150 k
press: 1.00000 atm
elementType: 7 7 7 6 6 6 6 6 6 6 6 1 1 1 1 1 1 1 1 1
symmnumber: 1
zpe: 417179.6 jmol-1
zpe.correction: 0.158895 hartree
zpe.thermalcorrener: 0.167938 hartree
zpe.thermalcorrenthalpy: 0.168883 hartree
zpe.thermalcorrgfe: 0.124971 hartree
zpe.sumelectzpe: -473.730630 hartree
zpe.sumelectthermal: -473.721587 hartree
zpe.sumelectthermalent: -473.720643 hartree
zpe.sumelectthermalfe: -473.764554 hartree
dipole: 3.9984 3.4335 0.0004
dipole: 5.2703
quadrupole: -45.8845 -61.0467 -69.8132
quadrupole: 2.6922 0.0015 -0.0001
quadrupole: 13.0303 -2.1319 -10.8984 2.6922 0.0015 -0.0001
hfenergy: -473.8895258 hartree
pointgroup: C01 [X(C8H9N3)]
dipole: 1.5303886 1.399057 0.0001581 debye
dipolederiv: -0.831044 -0.0484984 -0.000091 -0.07594 -0.7502401 -0.000139 0.0002669 0.0004068 -0.1518592 -1.2463781 -0.0266347 -0.000102 -0.2864439 -0.5060739 -0.0000163 -0.0000571 -0.0000079 -0.3056375 -1.7138634 0.2467391 -0.0000358 0.173808 -0.2495932 0.0000182 -0.0000819 0.0000412 -0.7480018 0.5959132 0.1527387 0.0000058 0.5072745 -0.2028918 0.0000368 -0.0000425 -0.0000907 0.0418246 0.6702968 -0.1551886 0.0000857 -0.6077343 0.0153329 -0.0000657 0.0000606 -0.000022 0.0053635 1.9316193 -0.2593633 0.0001167 0.1306822 0.9019533 -0.0000248 0.0000263 -0.0001122 0.2064179 0.0816215 -0.0879102 0.0000176 -0.0063646 0.0695655 0.0000272 0.000033 -0.0000161 -0.2001867 0.2764259 0.2549291 0.0000944 0.2980769 0.3717226 0.0004087 0.0000259 0.0002348 0.267729 -0.0233105 0.065777 -0.0000027 -0.0170384 0.1085999 -0.0000159 0.0000122 0.0000001 -0.1729961 -0.1356342 0.021389 -0.0000011 -0.1046407 0.0442823 -0.0000197 0.0000152 0.0000236 -0.202511 0.0057263 0.020603 0.0000024 0.1573977 -0.0354943 -0.0000085 -0.0000095 -0.000011 -0.1910612 0.0811948 -0.060295 -0.0000016 -0.0240196 -0.1327798 0.0000007 -0.0000242 -0.0000052 0.1735744 -0.0464747 -0.1077912 -0.1047811 -0.0489315 0.0373999 0.0220687 -0.1295629 -0.0507232 -0.0650923 -0.0472361 -0.1077674 0.1051343 -0.048356 0.0378353 -0.0224849 0.1295301 0.0500513 -0.0643331 0.0296006 0.1446813 -0.0003786 0.0331009 -0.0185322 0.0001758 -0.0002417 0.0002116 0.122754 0.0868633 -0.0117954 -0.0000022 -0.0428904 -0.0877262 0.0000133 0.000001 0.0000163 0.1662814 -0.0691009 0.1069184 -0.0000177 0.1145499 -0.0005765 0.0000141 -0.0000127 0.0000073 0.1688304 -0.13138 -0.0789395 -0.0000104 -0.0804971 0.0564736 0.0000023 -0.000008 -0.0000018 0.1659974 0.2404239 -0.0428115 -0.0000167 -0.0890228 0.2020352 -0.0000027 0.0000191 -0.0000084 0.3970638 0.2447363 -0.0267802 -0.000016 0.0169892 0.1387075 0.0000118 0.0000502 0.0000057 0.3858425 unknown
polarizability: 160.2424498|-0.7855008|108.0783751|0.0082034|0.000115|47.9750679 unknown
InChI: InChI=1S/C8H9N3/c1-11-7-5-3-2-4-6(7)10-8(11)9/h2-5H,9H2,1H3
charge 0 multiplicity 1
20 atoms
N  1.198956 0.742262 0.000088
N  0.870454 -1.54091 0.000323
N  3.14231 -0.724818 0.000403
C  -0.203313 0.545932 0.000119
C  -0.381614 -0.882058 0.000214
C  1.774258 -0.543413 0.000294
C  -1.285072 1.443856 0.000017
C  1.916142 2.014533 0.000404
C  -1.686083 -1.421381 0.00018
C  -2.585488 0.882521 -0.000012
C  -2.780466 -0.526222 0.000062
H  -1.147443 2.531344 -0.000006
H  2.547278 2.124153 0.903444
H  2.550277 2.122738 -0.900699
H  1.186713 2.839368 -0.001536
H  -1.83239 -2.505916 0.000239
H  -3.456634 1.547082 -0.000081
H  -3.801717 -0.923643 0.00004
H  3.484539 -1.680928 0.000463
H  3.799293 0.047902 0.000442
