program: Gaussian 09
title: 000069216
version: EM64L-G09RevD.01
frameworkgroup: C1[X(C4H6N2O2)]
method: RPBEPBE
basis: SDD
operation: Freq
keyword: #pfreq=noraman
keyword: PBEPBE/SDD
title: #p freq=noraman PBEPBE/SDD
converged: NO YES NO NO
title: Mulliken charges:
elementType: O O N N C C C C H H H H H H
charge: -0.212322 -0.234336 -0.388878 -0.402431 -0.144364 0.189804 -0.659142 0.195485 0.263740 0.333472 0.220933 0.252275 0.231884 0.353879
chargesum: 0.00000
title: Mulliken charges with hydrogens summed into heavy atoms:
elementType: O O N N C C C C
charge: -0.212322 -0.234336 -0.055406 -0.048552 0.119376 0.189804 0.045950 0.195485
polarizability: 8.11951689e+01 9.81387831e-01 6.07172679e+01 -3.59848671e+00 2.81984521e+00 3.78658078e+01
1716.lowfreq: -8.9211 0.0003 0.0004 0.0006 5.9913 7.2071 108.5123 161.1642 216.0209
frequency: 108.5055 161.1634 216.0168 232.3924 361.1615 408.2921 471.3834 533.8152 603.4351 629.9680 661.1641 697.7817 727.0363 789.0164 932.9503 965.5932 1037.0000 1094.3897 1119.6202 1181.9444 1255.0572 1299.0095 1310.3477 1337.0154 1370.2266 1390.7303 1470.4584 1475.3200 1685.3349 1725.8124 2987.9887 2996.0559 3097.7872 3109.1734 3591.7658 3611.8654
redmass: 4.1522 8.8932 1.0544 2.9030 9.1281 3.9554 1.1519 3.6137 10.9293 2.1468 1.7578 5.3769 6.1953 2.9131 2.2362 2.9495 1.6468 2.7607 1.7148 2.5862 2.5870 1.5466 1.6374 2.7375 1.7067 1.2504 1.0504 1.0544 8.2307 9.5865 1.0833 1.0352 1.1010 1.1011 1.0803 1.0802
irintensity: 1.5907 1.6123 0.4098 3.3098 16.2916 9.3670 102.3793 20.7572 13.0960 67.5270 83.3587 4.6221 66.5905 12.6077 8.8415 12.5837 14.9196 16.0085 17.6058 74.3252 101.4043 41.9394 15.2074 125.6370 17.0904 15.7262 14.1140 5.4776 596.8890 317.2983 18.3723 17.5761 19.1510 17.0002 69.6376 45.5935
temp: 298.150 k
press: 1.00000 atm
elementType: 8 8 7 7 6 6 6 6 1 1 1 1 1 1
symmnumber: 1
zpe: 279008.5 jmol-1
zpe.correction: 0.106269 hartree
zpe.thermalcorrener: 0.113582 hartree
zpe.thermalcorrenthalpy: 0.114526 hartree
zpe.thermalcorrgfe: 0.074654 hartree
zpe.sumelectzpe: -415.408543 hartree
zpe.sumelectthermal: -415.401230 hartree
zpe.sumelectthermalent: -415.400286 hartree
zpe.sumelectthermalfe: -415.440158 hartree
dipole: 1.5246 -2.6646 -0.6128
dipole: 3.1305
quadrupole: -61.1280 -42.2203 -45.3615
quadrupole: -7.8131 0.6814 2.3201
quadrupole: -11.5581 7.3496 4.2084 -7.8131 0.6814 2.3201
hfenergy: -415.514812 hartree
pointgroup: C01 [X(C4H6N2O2)]
dipole: -0.5239623 -1.090725 0.2295836 debye
dipolederiv: -0.9680977 0.3062929 0.0155829 0.3734964 -0.7236188 0.010528 -0.0181948 0.0441907 -0.3540864 -1.3749786 -0.106957 0.1003646 0.002621 -0.524724 0.0263971 0.1217672 0.0495516 -0.3861973 -0.7978855 -0.3491971 0.0411705 -0.3280172 -0.7560488 0.0472564 0.0233216 0.0557178 -0.549348 -1.4338407 0.4242296 0.0096536 0.1482557 -0.6366807 0.0174336 0.0843046 0.0139926 -0.3636189 0.5275152 0.0268908 -0.012582 -0.1075042 -0.2573657 0.1202487 0.0131056 0.1359311 0.3444038 1.690569 -0.3706135 -0.0961518 -0.0499945 0.8829308 -0.0915797 -0.1596234 -0.144608 0.225024 -0.0594125 0.0270647 -0.0357979 -0.0143224 0.0744579 -0.0502561 -0.0393986 0.0015781 0.015152 2.0465033 0.0357783 -0.1782896 -0.1193056 1.4106756 -0.2016299 -0.1746727 -0.2500879 0.3623566 -0.0211808 -0.0128772 0.0406255 0.0149015 0.0805969 0.0045323 0.0622858 -0.000866 -0.0955475 0.149041 0.0036648 0.0277181 0.0184469 0.2041522 0.0358082 0.044046 0.0373257 0.372188 0.0952136 -0.0048272 -0.021083 -0.0345451 -0.1465222 0.0417493 -0.0214428 0.0615128 0.0599187 -0.0801471 0.0203878 0.005276 0.0776595 0.0788781 -0.0114675 0.0074683 -0.0273895 0.101882 0.0655248 -0.0121808 0.0867362 -0.0275915 0.0836235 0.0223847 0.0380907 -0.0150392 -0.0963752 0.161176 0.0123438 0.0167769 0.0458994 0.229645 0.0285948 0.0189425 0.0381904 0.3642482 unknown
polarizability: 81.3254102|0.6064573|60.702034|-2.6735294|-3.0062998|37.7508004 unknown
InChI: InChI=1S/C4H6N2O2/c1-2-3(7)6-4(8)5-2/h2,5-6H,1H3
charge 0 multiplicity 1
14 atoms
O  -1.820378 1.508363 0.017594
O  2.668694 0.053898 -0.166925
N  0.626734 -1.076889 0.323365
N  0.51768 1.11127 -0.148128
C  -0.806426 -0.752072 0.424081
C  -0.816081 0.761977 0.081902
C  -1.719554 -1.559836 -0.522134
C  1.426576 0.008235 -0.009866
H  -1.167106 -0.864579 1.466339
H  1.027628 -1.997947 0.487115
H  -1.742529 -2.624394 -0.229567
H  -2.74524 -1.15686 -0.466801
H  -1.365995 -1.48637 -1.56465
H  0.839195 2.045504 -0.401925
