program: Gaussian 09
title: 000069210
version: EM64L-G09RevD.01
frameworkgroup: C1[X(C6H12N2O2)]
method: RPBEPBE
basis: SDD
operation: Freq
keyword: #p
keyword: freq=noraman
keyword: PBEPBE/SDD
title: #p freq=noraman PBEPBE/SDD
converged: YES YES NO NO
title: Mulliken charges:
elementType: O O N N C C C C C C H H H H H H H H H H H H
charge: -0.284373 -0.284340 -0.333769 -0.333756 -0.336150 -0.336385 0.119211 0.119183 -0.648384 -0.648146 0.222161 0.252132 0.222090 0.252088 0.343890 0.343936 0.234235 0.211156 0.219901 0.234324 0.211153 0.219842
chargesum: 0.00000
title: Mulliken charges with hydrogens summed into heavy atoms:
elementType: O O N N C C C C C C
charge: -0.284373 -0.284340 0.010121 0.010179 0.138143 0.137793 0.119211 0.119183 0.016908 0.017173
polarizability: 1.20503715e+02 -9.69037886e+00 8.26728006e+01 -3.41009838e-02 5.42918158e-02 5.99418698e+01
1716.lowfreq: -0.0008 -0.0003 0.0002 5.2015 6.9304 16.8831 30.2123 34.2040 59.6242
frequency: 30.2104 34.1632 59.6236 109.0603 112.5591 148.8035 197.7941 239.2386 274.3371 315.2869 328.2615 411.5776 424.3715 502.7475 538.4151 719.1275 742.5928 744.6716 773.3711 781.1927 813.0129 877.3240 877.4103 923.1183 1043.3736 1077.7030 1093.1443 1124.3878 1148.9274 1152.1801 1209.1076 1233.6750 1281.9165 1286.9505 1353.6256 1355.7937 1390.2293 1390.2739 1469.5108 1470.3522 1472.7217 1473.0695 1483.0615 1483.1714 1503.9486 1514.4554 1630.5489 1636.0372 2985.9910 2986.1339 2993.9504 2994.6143 3065.6511 3065.7585 3086.4164 3086.5161 3098.9047 3099.0418 3467.4741 3468.3523
redmass: 2.4086 3.3092 3.4315 3.6122 5.3688 2.0839 1.3883 1.3227 2.2127 3.4362 4.5130 3.8290 2.8767 9.0149 5.4826 2.5489 1.1886 1.0995 1.3249 7.3754 1.5248 2.2013 2.0133 2.5491 3.6633 2.6089 1.9321 2.4475 1.7423 1.9373 2.2191 2.0418 1.1444 1.1458 1.2927 1.3101 1.2147 1.2150 1.0641 1.0503 1.0562 1.0569 1.0733 1.0731 1.9026 2.1770 7.3491 9.8986 1.0357 1.0358 1.0648 1.0647 1.0985 1.0986 1.0988 1.0988 1.1017 1.1018 1.0761 1.0774
irintensity: 0.2892 0.1027 6.2944 3.0251 5.5976 4.1589 0.0003 9.0330 0.0499 0.2217 46.9981 2.3969 4.2855 6.7987 9.5774 5.2474 2.1477 231.2304 0.9020 0.6952 26.5133 2.1094 7.9440 1.1396 1.1900 15.1629 10.1915 1.6840 48.1795 0.9316 41.8277 0.1225 80.4856 0.7474 7.4639 0.0356 14.3765 17.9104 79.6554 1.7071 0.8251 12.0837 10.7742 23.6274 390.9276 0.0277 393.0140 0.5546 27.1406 28.7481 45.0964 40.6438 2.5408 0.3738 80.9135 1.2483 41.2993 28.7258 0.8395 104.2069
temp: 298.150 k
press: 1.00000 atm
elementType: 8 8 7 7 6 6 6 6 6 6 1 1 1 1 1 1 1 1 1 1 1 1
symmnumber: 1
zpe: 482425.5 jmol-1
zpe.correction: 0.183746 hartree
zpe.thermalcorrener: 0.195517 hartree
zpe.thermalcorrenthalpy: 0.196461 hartree
zpe.thermalcorrgfe: 0.144266 hartree
zpe.sumelectzpe: -495.026056 hartree
zpe.sumelectthermal: -495.014285 hartree
zpe.sumelectthermalent: -495.013341 hartree
zpe.sumelectthermalfe: -495.065535 hartree
dipole: 0.0012 -0.0019 0.3061
dipole: 0.3061
quadrupole: -42.0607 -68.9992 -60.8138
quadrupole: -6.0950 -0.0132 -0.0254
quadrupole: 15.2305 -11.7080 -3.5225 -6.0950 -0.0132 -0.0254
hfenergy: -495.2098018 hartree
pointgroup: C01 [X(C6H12N2O2)]
dipole: -0.0002526 -0.1204425 0.0000587 debye
dipolederiv: -0.7230526 0.0024349 -0.0769457 -0.0027807 -0.3596242 0.0024711 0.2806385 0.0458551 -0.9738657 -0.7230632 -0.0031095 -0.0769355 -0.0001657 -0.359314 0.0008023 0.2805813 -0.0414101 -0.9735882 -1.0973913 -0.0700232 0.3717414 -0.0690172 -0.4760179 -0.005668 0.2032197 0.0291456 -0.5551747 -1.0975611 0.0664632 0.3713929 0.064697 -0.4757772 0.008763 0.2033585 -0.0276238 -0.555055 0.6388638 0.0281843 -0.075556 0.0059567 0.311373 0.0425938 0.2118401 0.0341192 0.0752246 0.6388551 -0.0277364 -0.0753581 -0.0051561 0.311415 -0.0427314 0.2116939 -0.0323161 0.0757327 0.9815524 0.0035354 -0.304002 0.0052601 0.1979851 0.0042021 -0.6204131 -0.0649546 1.1490985 0.9817067 0.0005258 -0.3038654 0.0009864 0.1976342 -0.0109126 -0.6202861 0.0575097 1.1485552 -0.0581163 -0.0424604 0.0319948 -0.0363555 -0.0527292 0.0106688 -0.0296241 0.0300454 0.108042 -0.0582007 0.0422497 0.0320829 0.0361409 -0.0532007 -0.0102953 -0.0296958 -0.0302028 0.1078304 -0.0917912 0.0515241 0.049957 0.0830894 -0.1032585 -0.0671988 0.035041 -0.1034427 0.0717372 0.081907 -0.0248292 0.0429905 -0.0198456 0.080082 0.022319 -0.0796612 0.0421951 -0.0433411 -0.0909165 -0.0516035 0.0496584 -0.0828867 -0.1031888 0.0675426 0.0350829 0.1037262 0.0716055 0.0815348 0.0249921 0.0430569 0.0201018 0.0799863 -0.0223695 -0.0795655 -0.0431279 -0.043467 0.2966085 -0.0022371 -0.0122045 0.0259439 0.3331554 0.016618 0.0079845 0.0078125 0.2050732 0.2964573 0.0022094 -0.0122575 -0.0259995 0.3332384 -0.0163089 0.0079479 -0.0071303 0.2051459 0.0651607 0.0953042 0.0518513 0.046917 -0.0748771 -0.0552337 0.0518505 -0.0788317 0.0466806 0.1068731 -0.0087174 -0.0367175 -0.0182909 0.0611135 0.0062762 0.0076985 0.0531842 -0.165069 -0.2006361 -0.0201824 -0.0430909 -0.0234862 0.0827814 0.0284611 -0.0686086 0.011321 0.0816043 0.0652314 -0.0949078 0.0519586 -0.0466917 -0.0746443 0.0553416 0.0518108 0.0790615 0.0465336 0.1068532 0.0088583 -0.0365955 0.018335 0.0610167 -0.0067402 0.0078944 -0.0535552 -0.1649171 -0.200875 0.0195255 -0.043156 0.0232476 0.0828509 -0.0286014 -0.0687881 -0.0113804 0.0816139 unknown
polarizability: 118.4744454|0.1167649|59.9422625|-12.9051804|-0.1056825|84.701678 unknown
InChI: InChI=1S/C6H12N2O2/c1-3-7-5(9)6(10)8-4-2/h7-8H,3-4H2,1-2H3
charge 0 multiplicity 1
22 atoms
O  -0.783546 0.192051 -1.627104
O  0.783167 0.185139 1.626523
N  -1.721441 0.20048 0.535535
N  1.720972 0.209792 -0.536003
C  -3.137819 0.175498 0.14478
C  3.137372 0.18716 -0.145157
C  -0.687559 0.195907 -0.356305
C  0.687124 0.196007 0.355769
C  -3.841856 -1.131373 0.567096
C  3.843232 -1.119516 -0.56525
H  -3.652492 1.047468 0.592936
H  -3.165129 0.293758 -0.952294
H  3.65074 1.059096 -0.594762
H  3.164562 0.306967 0.951752
H  -1.442062 0.191687 1.525009
H  1.44164 0.205687 -1.525508
H  -3.362627 -2.003421 0.089809
H  -3.807738 -1.273208 1.662993
H  -4.903237 -1.105621 0.260468
H  3.364934 -1.991333 -0.086614
H  3.809461 -1.263127 -1.66091
H  4.904503 -1.091998 -0.258363
