program: Gaussian 09
title: 000074179
version: EM64L-G09RevD.01
frameworkgroup: C1[X(C13H11NO)]
method: RPBEPBE
basis: SDD
operation: Freq
keyword: #p
keyword: freq=noraman
keyword: PBEPBE/SDD
title: #p freq=noraman PBEPBE/SDD
converged: YES YES NO NO
title: Mulliken charges:
elementType: O N C C C C C C C C C C C C C H H H H H H H H H H H
charge: -0.214789 -0.046719 -0.631424 0.135055 0.294238 0.164796 -0.332454 -0.349603 -0.278246 -0.249694 -0.227032 -0.197203 -0.221564 -0.176171 -0.376000 0.246047 0.274759 0.248557 0.278283 0.252033 0.231920 0.234244 0.237130 0.234298 0.229836 0.239704
chargesum: 0.00000
title: Mulliken charges with hydrogens summed into heavy atoms:
elementType: O N C C C C C C C C C C C C C
charge: -0.214789 -0.046719 -0.110618 0.135055 0.294238 0.164796 -0.083897 -0.071320 -0.026214 -0.017774 0.007213 0.039927 0.012734 0.053665 -0.136297
polarizability: 2.23704627e+02 -9.09179246e+00 1.34361324e+02 5.71524982e+00 1.18308017e+00 7.83641834e+01
1716.lowfreq: -6.6074 -5.2699 -0.0009 -0.0007 -0.0003 7.3691 24.2089 31.4903 63.1036
frequency: 24.1292 31.3979 63.0958 80.1805 149.4524 163.1969 221.6109 295.0769 326.0460 398.7061 406.0762 411.6393 444.6396 472.6398 569.9535 581.1046 613.1214 616.1003 665.1948 696.2461 739.9011 751.6750 771.5019 803.6245 838.9413 858.6409 894.7542 921.2738 952.5069 960.0433 968.2686 987.5248 989.6089 991.5091 998.4285 1011.4155 1027.6336 1042.9273 1083.7133 1086.9657 1160.4911 1169.6369 1173.5776 1189.9281 1206.8398 1240.8920 1287.1661 1316.0942 1319.7373 1331.3393 1387.6262 1413.4052 1429.4565 1435.9772 1459.6208 1479.3941 1566.4140 1571.9008 1585.1286 1600.3507 1613.8081 2965.8735 3050.3351 3126.8257 3129.2883 3139.0499 3140.5631 3150.3648 3159.5060 3163.1889 3169.8606 3177.9348
redmass: 5.2338 4.1893 4.6190 4.7183 4.9345 5.0576 4.5668 4.2018 3.3237 2.8279 3.3666 3.4211 6.7707 3.1768 2.8580 5.4571 6.4972 6.9589 5.7747 1.8181 3.7251 1.3440 1.7929 4.1840 4.2381 1.2536 1.3246 1.8117 1.5356 2.4625 2.9031 4.1686 6.2395 1.3937 1.3443 1.3475 2.0228 2.3169 1.6630 1.6014 1.1624 1.1007 1.0711 1.1277 1.9781 3.0458 1.8644 1.8387 2.4438 1.8906 9.1507 1.8457 1.1744 2.2337 2.3050 2.1749 5.8149 6.6332 5.7720 6.7202 6.7658 1.0655 1.0918 1.0878 1.0851 1.0881 1.0903 1.0925 1.0960 1.0968 1.1013 1.0990
irintensity: 1.3112 1.0806 1.7895 4.1305 0.0886 3.8461 3.3239 8.5151 3.6199 0.0488 4.8335 0.5553 0.7436 3.5454 17.4690 27.7991 0.6798 2.7960 7.1866 51.0424 4.5601 49.1083 65.2415 4.2272 8.2337 0.3834 1.0849 4.0840 3.0703 2.7591 3.4042 53.4418 4.0454 1.2807 0.2063 0.3052 0.7663 7.4381 6.9374 7.0082 0.4769 1.8979 6.1398 32.3331 96.7720 33.0305 68.9501 29.1286 25.3079 51.9470 3.2440 12.7653 17.9572 23.9502 60.1620 0.8253 10.7715 60.9868 46.0070 65.7321 14.4800 25.6263 10.6549 11.7916 0.1726 6.4458 14.4524 17.2195 19.8364 41.1177 21.8442 5.7988
temp: 298.150 k
press: 1.00000 atm
elementType: 8 7 6 6 6 6 6 6 6 6 6 6 6 6 6 1 1 1 1 1 1 1 1 1 1 1
symmnumber: 1
zpe: 533666.3 jmol-1
zpe.correction: 0.203263 hartree
zpe.thermalcorrener: 0.215597 hartree
zpe.thermalcorrenthalpy: 0.216541 hartree
zpe.thermalcorrgfe: 0.162335 hartree
zpe.sumelectzpe: -630.909563 hartree
zpe.sumelectthermal: -630.897229 hartree
zpe.sumelectthermalent: -630.896285 hartree
zpe.sumelectthermalfe: -630.950491 hartree
dipole: 1.2519 -0.7159 1.6936
dipole: 2.2244
quadrupole: -62.7131 -86.9602 -89.2659
quadrupole: -4.8551 -1.3740 -0.2903
quadrupole: 16.9333 -7.3138 -9.6195 -4.8551 -1.3740 -0.2903
hfenergy: -631.1128257 hartree
pointgroup: C01 [X(C13H11N1O1)]
dipole: -0.491679 -0.5833452 -0.4287809 debye
dipolederiv: -0.9397605 -0.0968684 0.0294723 -0.2281779 -0.7235201 0.1163099 0.135509 0.1209333 -0.3125549 -0.5370942 -0.0062964 -0.0182026 -0.0428517 -0.2506619 0.0451912 -0.137545 0.0505491 -0.3232589 -0.4840242 0.1296956 -0.0389532 0.4079934 -0.2000309 0.0586944 -0.1317551 0.0538065 0.0814856 1.916237 0.0185918 -0.0826463 -0.1805348 0.7893893 -0.1451659 -0.066956 -0.1734114 0.175439 -0.8512332 -0.0653772 0.0546144 0.0493108 -0.0689207 0.0131573 0.0315336 0.0240239 -0.0286299 0.8144832 0.0469043 0.0771218 0.3402116 0.0132482 -0.0042882 -0.0678389 -0.0391742 0.0795593 0.1174227 -0.0862764 0.0037153 0.1005521 -0.0022942 -0.0274717 -0.0475452 -0.0325346 -0.1138445 0.0195257 0.1327413 -0.0403504 -0.1463613 0.0159251 -0.023434 0.0303943 -0.035236 -0.0944791 -0.2793127 -0.0702645 0.0590971 -0.270673 -0.0730959 -0.0633816 0.2132968 0.0176177 -0.0301267 -0.2241722 0.1114109 -0.0243388 0.1838783 0.0871769 -0.0686252 -0.0322766 -0.0663579 -0.1394559 -0.0605151 -0.1948535 0.0379824 -0.1894398 0.0039375 -0.027313 0.0418744 -0.0243466 -0.1512474 0.1322015 0.0759467 -0.0159757 0.0748393 -0.0424322 -0.1313842 -0.006003 -0.1119781 0.1020317 0.1327512 0.0179837 -0.0229918 -0.0094503 0.0211214 -0.0354403 -0.0165667 -0.0378634 -0.1231063 0.0036297 0.0162253 0.0487986 0.0735087 -0.1324628 0.0585975 -0.0826437 0.0273552 -0.2184307 0.1355522 0.0298009 0.0386682 -0.0613738 -0.0067914 -0.1606475 0.2317757 -0.1351527 0.2643389 -0.0167201 -0.0384197 -0.0347044 -0.0815499 0.0321653 -0.0604946 -0.0624796 -0.0831905 0.0184036 0.0588991 -0.0049992 0.0378553 -0.0611478 0.0785095 0.0365641 0.1364172 0.0522817 0.0134857 0.0462379 0.1019204 -0.0150857 0.1227872 0.0030381 0.0265862 -0.0261208 0.0304083 0.1334809 0.1374694 -0.0627423 0.0183311 -0.0194217 0.0129802 0.0328533 0.0021943 0.0383746 0.1417305 0.0812575 0.0159061 -0.0885145 0.0303361 0.1125407 0.0645681 -0.112888 0.0372048 0.0141357 0.042315 -0.0581301 0.019654 -0.0853355 -0.0751419 0.059185 0.0281106 0.0594965 0.143522 -0.0237294 0.0936639 -0.0114415 0.1125908 -0.0235891 0.0360174 -0.014225 0.0367419 0.1500374 0.0348021 -0.0498025 0.0623406 -0.0662094 0.0878293 0.0925097 0.0768849 0.0892363 -0.0030048 -0.1246007 -0.0285969 0.0238301 -0.0295937 0.0939952 0.0163942 0.0226326 0.0166767 0.1516248 -0.1281723 -0.045187 -0.0321151 -0.0570328 0.1416318 0.0216867 -0.0198792 0.0220309 0.1090492 -0.0034494 0.0170232 -0.0861611 0.0331451 0.1054525 0.0693312 -0.1259006 0.0625081 -0.0401852 unknown
polarizability: 223.7678077|10.5523211|118.3444002|0.9754177|-25.2310704|94.3179267 unknown
InChI: InChI=1S/C13H11NO/c15-13(11-6-2-1-3-7-11)10-12-8-4-5-9-14-12/h1-9H,10H2
charge 0 multiplicity 1
26 atoms
O  -0.047867 1.518641 -0.649167
N  2.668515 -0.834711 1.080598
C  0.51552 -0.796905 -0.066128
C  -0.456634 0.371538 -0.307487
C  -1.928645 0.103359 -0.143409
C  1.98721 -0.434486 -0.039117
C  -2.445689 -1.177618 0.192353
C  -2.832331 1.183561 -0.341593
C  2.623364 0.255252 -1.102629
C  -3.837074 -1.372106 0.325619
C  -4.220444 0.989413 -0.205039
C  4.004936 0.528932 -1.01331
C  -4.726983 -0.290424 0.128939
C  4.715697 0.111638 0.135873
C  4.004436 -0.56217 1.153224
H  0.3199 -1.552189 -0.857161
H  0.282483 -1.287283 0.89626
H  -1.770802 -2.024932 0.351017
H  -2.414804 2.162342 -0.600138
H  2.039189 0.583252 -1.966164
H  -4.227851 -2.362203 0.584255
H  -4.908424 1.828246 -0.356647
H  4.516227 1.062095 -1.821994
H  -5.806841 -0.443009 0.235715
H  5.787771 0.304321 0.245105
H  4.509739 -0.899153 2.065823
