program: Gaussian 09
title: 000069193
version: EM64L-G09RevD.01
frameworkgroup: C1[X(C14H12O2)]
method: RPBEPBE
basis: SDD
operation: Freq
keyword: #pfreq=noraman
keyword: PBEPBE/SDD
title: #p freq=noraman PBEPBE/SDD
converged: YES YES NO NO
title: Mulliken charges:
elementType: O O C C C C C C C C C C C C C C H H H H H H H H H H H H
charge: -0.317085 -0.242167 0.469895 0.396155 -0.459148 -0.435868 0.216273 -0.420943 -0.185350 -0.804863 0.159021 -0.331230 -0.329637 -0.221668 -0.216393 -0.222581 0.304150 0.233953 0.252491 0.228180 0.233129 0.236827 0.221390 0.269392 0.266658 0.234134 0.231879 0.233406
chargesum: 0.00000
title: Mulliken charges with hydrogens summed into heavy atoms:
elementType: O O C C C C C C C C C C C C C C
charge: -0.317085 -0.242167 0.469895 0.396155 -0.154998 -0.201915 0.216273 -0.168452 0.042830 -0.113517 0.159021 -0.061837 -0.062979 0.012466 0.015486 0.010824
polarizability: 2.57631224e+02 -1.38853329e-01 1.66407134e+02 -1.49528343e-01 -1.50920545e-01 6.49961622e+01
1716.lowfreq: -4.2016 0.0004 0.0006 0.0008 9.1571 11.1814 22.7727 33.0254 39.9900
frequency: 22.4670 32.9326 39.9662 73.0381 81.0033 159.6345 176.0602 207.1124 254.9724 273.3887 310.9027 376.7134 403.9241 437.5944 440.4192 456.6323 513.7765 561.4684 566.9680 614.5409 671.8895 673.7309 694.0233 700.3312 716.7481 790.3183 795.2647 804.1088 864.3080 893.4725 900.0309 927.5963 955.5167 977.5831 984.3805 990.4536 996.9549 999.2162 1009.5742 1020.2217 1047.7088 1050.4481 1086.3004 1092.6646 1132.3081 1173.4848 1174.3794 1182.5252 1232.4644 1247.4300 1300.4253 1315.5562 1381.2839 1390.6342 1398.4650 1423.1661 1438.4841 1470.4966 1474.4368 1476.9385 1480.6836 1584.6393 1597.9344 1606.1645 1611.0277 1624.7313 2979.2406 3059.9593 3088.4474 3128.6395 3131.0392 3143.5834 3149.0877 3156.3939 3168.1250 3171.6562 3182.5776 3195.6213
redmass: 4.3087 1.0355 4.8830 7.3355 4.8222 4.8152 4.7485 3.0856 5.4023 5.2509 6.1279 3.6045 2.8299 3.3754 3.1433 6.6442 5.0704 3.7930 8.3444 6.4368 5.0951 7.1707 2.2083 1.6461 7.1724 1.5191 1.9595 8.7186 1.2451 1.3222 3.6844 1.3615 1.4212 1.3401 4.8356 6.1628 1.3848 1.7607 1.3300 2.7464 2.6289 1.5618 1.6182 1.4878 2.0758 1.1098 1.0565 1.1377 3.6638 3.9635 1.3016 1.3162 7.3714 9.8876 1.2494 2.5474 2.2556 1.0912 1.6555 2.1796 1.4750 6.7165 6.1672 6.5217 6.1175 10.7434 1.0378 1.0965 1.0995 1.0873 1.0855 1.0893 1.0931 1.0941 1.0984 1.0978 1.0968 1.0926
irintensity: 0.9525 0.4083 1.5356 0.0945 1.0683 0.3820 1.0903 1.8932 0.1024 0.9277 7.3933 2.1248 0.0002 0.5552 6.4646 1.5225 2.7370 0.0887 6.5055 1.0102 16.0564 9.3686 10.7034 101.4083 1.5601 24.0685 59.6965 4.3887 0.0055 1.0965 7.2281 16.7842 5.1108 0.3204 19.4541 2.8945 0.0353 8.3525 0.4026 114.4513 203.4749 17.8590 11.1335 18.1249 218.9569 0.2419 0.3154 68.4301 486.6739 10.5166 12.3177 0.5288 6.8970 3.4889 16.8481 31.1174 10.5969 14.7419 21.4994 5.4666 70.6311 27.1914 56.2693 10.4856 5.1127 161.2446 31.0650 20.1302 20.4850 7.5693 0.1039 10.9635 27.3320 16.5861 23.8961 9.0559 7.9562 4.6981
temp: 298.150 k
press: 1.00000 atm
elementType: 8 8 6 6 6 6 6 6 6 6 6 6 6 6 6 6 1 1 1 1 1 1 1 1 1 1 1 1
symmnumber: 1
zpe: 573719.4 jmol-1
zpe.correction: 0.218518 hartree
zpe.thermalcorrener: 0.232477 hartree
zpe.thermalcorrenthalpy: 0.233422 hartree
zpe.thermalcorrgfe: 0.175259 hartree
zpe.sumelectzpe: -690.028374 hartree
zpe.sumelectthermal: -690.014415 hartree
zpe.sumelectthermalent: -690.013470 hartree
zpe.sumelectthermalfe: -690.071633 hartree
dipole: 0.6391 1.4661 0.0266
dipole: 1.5996
quadrupole: -68.4484 -86.2446 -98.8027
quadrupole: 1.4354 -0.1624 -0.0224
quadrupole: 16.0502 -1.7460 -14.3041 1.4354 -0.1624 -0.0224
hfenergy: -690.246892 hartree
pointgroup: C01 [X(C14H12O2)]
dipole: -0.2439904 0.1957024 -0.546112 debye
polarizability: 257.5846678|-2.7888994|77.5094956|0.0851193|-33.309345|153.9403569 unknown
InChI: InChI=1S/C14H12O2/c1-11-6-5-9-13(10-11)16-14(15)12-7-3-2-4-8-12/h2-10H,1H3
charge 0 multiplicity 1
28 atoms
O  0.092864 0.023186 -0.453211
O  -0.352615 -0.777637 1.718134
C  3.734747 -0.37856 0.53976
C  1.522065 -0.002559 -0.42854
C  2.319782 -0.410902 0.663495
C  4.317019 0.066182 -0.672204
C  -2.184568 -0.192571 0.22248
C  2.098821 0.439209 -1.641457
C  3.501826 0.470864 -1.755758
C  4.599232 -0.835073 1.703121
C  -0.752457 -0.358014 0.606527
C  -3.1671 -0.536474 1.188537
C  -2.585003 0.288703 -1.051752
C  -4.536102 -0.400205 0.883227
C  -3.956683 0.423284 -1.352163
C  -4.933961 0.079926 -0.387724
H  1.852662 -0.746757 1.590584
H  5.408399 0.09623 -0.768851
H  1.446082 0.748975 -2.462786
H  3.960843 0.814028 -2.689234
H  4.262493 -0.386762 2.655244
H  4.550304 -1.933924 1.826478
H  5.657692 -0.56238 1.551511
H  -2.835381 -0.905346 2.164692
H  -1.82134 0.550652 -1.788466
H  -5.291345 -0.666177 1.630484
H  -4.265035 0.79481 -2.335359
H  -5.99854 0.185691 -0.624867
