program: Gaussian 09
title: 000069191
version: EM64L-G09RevD.01
frameworkgroup: C1[X(C14H15N)]
method: RPBEPBE
basis: SDD
operation: Freq
keyword: #pfreq=noraman
keyword: PBEPBE/SDD
title: #p freq=noraman PBEPBE/SDD
converged: YES YES NO NO
title: Mulliken charges:
elementType: N C C C C C C C C C C C C C C H H H H H H H H H H H H H H H
charge: -0.179580 -0.566666 0.445576 0.449855 -0.670183 -0.411961 -0.373081 -0.388331 -0.360539 -0.221276 -0.233794 -0.223016 -0.238031 -0.242085 -0.272014 0.235306 0.247242 0.241066 0.238914 0.223660 0.228638 0.261802 0.235453 0.232368 0.225184 0.226935 0.217255 0.218345 0.228459 0.224502
chargesum: 0.00000
title: Mulliken charges with hydrogens summed into heavy atoms:
elementType: N C C C C C C C C C C C C C C
charge: -0.179580 -0.084118 0.445576 0.449855 0.033456 -0.183324 -0.111279 -0.152878 -0.128171 0.003908 -0.006860 -0.005761 -0.019686 -0.013626 -0.047512
polarizability: 2.16924915e+02 9.60151107e+00 1.36173694e+02 -1.23313766e+01 -4.29112796e+00 1.11413704e+02
1716.lowfreq: -8.0446 -5.2737 -0.0005 -0.0004 0.0003 6.8889 20.4012 29.6771 51.7315
frequency: 20.3174 29.5810 51.6724 99.8592 148.7412 174.4711 190.2356 227.1221 295.8718 300.5845 386.7176 404.0357 417.3274 455.9180 480.4496 512.3943 531.9022 604.8014 614.4601 616.2812 692.7897 703.7789 735.4115 749.0160 752.7670 787.3726 813.4411 856.9814 868.3891 900.9623 947.3295 954.5337 973.1702 975.0925 979.6743 989.0687 993.4473 1001.5478 1026.2650 1030.3812 1082.9204 1090.7568 1107.4756 1115.5832 1171.0177 1171.6038 1183.6073 1193.5223 1200.1845 1216.8698 1261.7299 1300.7017 1333.1875 1345.3251 1376.2403 1381.4662 1390.0306 1437.7470 1443.7766 1449.6580 1467.6265 1475.5839 1485.1281 1493.2195 1508.7030 1576.3122 1594.4606 1613.8181 1621.7114 2931.2309 2962.7408 3021.6467 3024.8125 3087.7423 3107.8805 3119.9453 3124.3159 3126.0007 3136.6831 3147.3405 3149.1017 3155.2240 3162.7878 3167.5654
redmass: 4.0643 4.2421 3.5442 2.6883 4.1562 1.4343 2.8555 3.4222 5.0824 3.0228 2.5661 2.8397 2.9787 2.4005 3.3025 2.9763 4.3346 5.1546 6.2623 6.3421 1.8474 2.3478 1.5614 3.4457 1.8841 4.1808 1.2595 1.2554 1.4722 1.4246 2.5095 1.3761 1.3027 4.0275 1.4467 6.0977 1.6686 1.6832 2.2220 2.0753 1.5766 1.6760 1.3977 1.6181 1.0638 1.0535 1.2164 2.2239 1.1333 1.7285 1.9598 1.4061 1.4182 1.3942 2.7485 6.0635 3.6490 1.7316 1.5722 1.9437 1.1386 1.2472 1.6397 1.2320 2.0828 6.0194 6.1043 5.9468 5.9794 1.0459 1.0645 1.0957 1.0898 1.0981 1.0878 1.0844 1.0858 1.0883 1.0913 1.0932 1.0942 1.0938 1.1013 1.1003
irintensity: 0.1947 0.0891 0.4091 1.5494 1.7924 0.3841 1.8844 5.9448 1.6976 1.6882 2.0459 0.0747 0.1851 7.3869 5.0542 15.5470 2.1289 5.7434 0.4469 0.4592 43.4978 23.2685 56.0196 13.7479 77.9580 3.0301 0.2336 0.2164 7.2115 8.1454 28.1527 0.7959 0.9856 10.6279 0.3174 0.2056 4.7302 7.9842 17.0448 11.0852 5.2950 1.1294 9.1292 30.5175 0.3393 0.0964 7.1976 1.0115 11.7391 36.1511 51.6286 14.6457 5.0750 26.1465 63.7145 11.9830 1.4078 3.0688 25.0430 3.8877 34.6069 8.0624 5.8426 0.6010 183.0927 10.7801 0.6518 21.6106 185.8152 90.9091 53.1572 7.3819 32.5937 19.7243 11.0913 10.4943 0.1846 9.5562 18.5111 68.4440 4.1898 35.8758 25.9909 9.3107
temp: 298.150 k
press: 1.00000 atm
elementType: 7 6 6 6 6 6 6 6 6 6 6 6 6 6 6 1 1 1 1 1 1 1 1 1 1 1 1 1 1 1
symmnumber: 1
zpe: 656804.6 jmol-1
zpe.correction: 0.250164 hartree
zpe.thermalcorrener: 0.263391 hartree
zpe.thermalcorrenthalpy: 0.264335 hartree
zpe.thermalcorrgfe: 0.208440 hartree
zpe.sumelectzpe: -596.157725 hartree
zpe.sumelectthermal: -596.144498 hartree
zpe.sumelectthermalent: -596.143554 hartree
zpe.sumelectthermalfe: -596.199449 hartree
dipole: 1.4878 1.3371 -0.0518
dipole: 2.0010
quadrupole: -85.9418 -83.9644 -88.0504
quadrupole: -0.7438 -3.6003 -0.3209
quadrupole: 0.0437 2.0211 -2.0648 -0.7438 -3.6003 -0.3209
hfenergy: -596.4078887 hartree
pointgroup: C01 [X(C14H15N1)]
dipole: -0.5822666 -0.5236422 0.0809162 debye
polarizability: 216.3088503|12.7222477|137.0595961|11.9354958|-0.8956799|111.1438672 unknown
InChI: InChI=1S/C14H15N/c1-15(14-10-6-3-7-11-14)12-13-8-4-2-5-9-13/h2-11H,12H2,1H3
charge 0 multiplicity 1
30 atoms
N  0.546782 -1.207893 0.104029
C  -0.550914 -1.169993 -0.870454
C  -1.800607 -0.405128 -0.416522
C  1.696154 -0.408273 -0.029178
C  0.470272 -2.236018 1.148456
C  -3.065094 -0.724455 -0.972835
C  -1.714634 0.638832 0.536744
C  2.883103 -0.70503 0.71181
C  1.7184 0.735381 -0.890516
C  -4.221749 -0.006855 -0.593712
C  -2.870833 1.356347 0.919884
C  4.033349 0.100803 0.586195
C  2.88013 1.523093 -1.011947
C  -4.127618 1.038276 0.354886
C  4.05101 1.219165 -0.278036
H  -0.843368 -2.210374 -1.12182
H  -0.172502 -0.734322 -1.814366
H  -0.579019 -2.555017 1.262986
H  0.803585 -1.835176 2.123629
H  1.085226 -3.132114 0.914723
H  -3.145908 -1.539781 -1.70399
H  -0.741916 0.877154 0.981121
H  2.915873 -1.576616 1.372285
H  0.820317 1.031612 -1.442329
H  -5.193344 -0.265873 -1.02987
H  -2.790839 2.162475 1.658178
H  4.928029 -0.157028 1.165553
H  2.862376 2.394325 -1.677543
H  -5.023823 1.59363 0.653583
H  4.948162 1.839254 -0.373843
