program: Orca
programVersion: 4.2.1
elementType: S F O O O O O O O O N N N N N C C C C C C C C C C C C C C C C C C H H H H H H H H H H H H H H H H H H H H H H
charge: 0
multiplicity: 1
keywords: wb97x-d3
keywords: def2-TZVPP
keywords: def2/J RIJCOSX GRIDX6 NOFINALGRIDX
keywords: grid4 nofinalgrid
keywords: scfconv7
keywords: smallprint printgap noloewdin
keywords: NOSOSCF
formula: C18H22FN5O8S
InChI: InChI=1S/C18H22FN5O8S/c1-10(19)16(32-14(25)9-29-2)15-11(6-5-7-20-15)33(27,28)24-18(26)23-17-21-12(30-3)8-13(22-17)31-4/h5-8,10,16,23-24H,9H2,1-4H3
55 atoms
S  2.009712 -1.750742 1.386618
F  1.221807 2.755957 1.977307
O  0.562582 1.97166 -0.655688
O  2.064726 -0.786648 2.470989
O  2.638394 -3.042335 1.546344
O  -0.506521 3.501073 -2.538441
O  -0.443563 0.131988 -1.418912
O  0.587749 -3.347789 -0.665005
O  -2.565555 0.812759 2.836917
O  -5.333805 -0.148558 -0.760006
N  2.737055 0.748859 -1.675855
N  0.385728 -1.933554 1.102357
N  -1.440266 -2.447833 -0.22983
N  -1.975548 -0.808678 1.335067
N  -3.397166 -1.319556 -0.475959
C  1.356387 1.199853 0.229033
C  2.270692 0.264346 -0.537886
C  2.144386 2.176972 1.09874
C  2.624498 -1.019612 -0.109322
C  2.868333 3.275141 0.362111
C  3.473556 -1.79072 -0.890156
C  3.954593 -1.259237 -2.071271
C  3.550616 0.016354 -2.421697
C  -0.288886 1.326183 -1.437622
C  -0.101956 -2.626666 0.020573
C  -1.09268 2.259408 -2.318664
C  -2.301746 -1.479222 0.240628
C  0.582193 3.453818 -3.436194
C  -2.831382 0.123847 1.742867
C  -4.233158 -0.376462 -0.067807
C  -4.003854 0.402392 1.060759
C  -1.374725 0.540506 3.568487
C  -5.567278 -0.901977 -1.947172
H  0.693885 0.636491 0.887006
H  2.847154 1.602054 1.703626
H  3.371654 3.922195 1.080734
H  3.63325 2.860818 -0.292313
H  2.196929 3.884559 -0.240983
H  3.755478 -2.789707 -0.590581
H  4.617753 -1.825799 -2.708597
H  -0.277504 -1.335299 1.61658
H  3.894939 0.468692 -3.343709
H  -2.049602 2.426245 -1.812289
H  -1.318397 1.722618 -3.248954
H  1.410115 2.838881 -3.067803
H  0.279451 3.070189 -4.417522
H  0.946279 4.472466 -3.565564
H  -4.693609 1.166703 1.387651
H  -0.484531 0.851167 3.019603
H  -1.442671 1.139341 4.472937
H  -1.293157 -0.510432 3.846177
H  -5.669548 -1.966713 -1.737318
H  -6.502815 -0.525749 -2.352797
H  -4.773819 -0.755456 -2.680338
H  -1.769469 -2.936634 -1.052729
elementType: S F O N C H
totalener: -2072.98806527 hartree
nucrepener: 4166.80659246 hartree
electener: -6239.79465772 hartree
twoeener: 4896.81572842 hartree
cpcmener: -0.04304344 hartree
kineticenergy: 2065.45540336 hartree
xcener: -172.088764624377 hartree
chargesum: -0.0000000
charge: 0.867153 -0.267376 -0.264459 -0.502238 -0.486121 -0.367094 -0.435564 -0.447359 -0.285140 -0.290976 -0.382362 -0.193554 -0.137618 -0.422045 -0.401068 0.286529 0.177622 0.226235 -0.176056 -0.280625 -0.021026 -0.142441 0.037836 0.383482 0.352181 0.038257 0.335917 -0.108991 0.424878 0.408268 -0.323329 -0.116532 -0.116184 -0.003390 0.086719 0.108846 0.092627 0.094820 0.153928 0.166374 0.209054 0.145078 0.116035 0.104688 0.083831 0.107564 0.119204 0.142782 0.090976 0.141112 0.122697 0.113817 0.131334 0.113307 0.188397
qa: 0.8672 -0.2674 -0.2645 -0.5022 -0.4861 -0.3671 -0.4356 -0.4474 -0.2851 -0.2910 -0.3824 -0.1936 -0.1376 -0.4220 -0.4011 0.2865 0.1776 0.2262 -0.1761 -0.2806 -0.0210 -0.1424 0.0378 0.3835 0.3522 0.0383 0.3359 -0.1090 0.4249 0.4083 -0.3233 -0.1165 -0.1162 -0.0034 0.0867 0.1088 0.0926 0.0948 0.1539 0.1664 0.2091 0.1451 0.1160 0.1047 0.0838 0.1076 0.1192 0.1428 0.0910 0.1411 0.1227 0.1138 0.1313 0.1133 0.1884
va: 5.8250 1.0006 2.1742 1.9774 2.0164 1.9436 2.0833 2.0681 2.1414 2.1284 2.9721 3.0545 3.1692 2.9362 2.9401 3.7435 3.7787 3.9046 3.7998 3.9586 3.9071 3.9087 4.0089 3.9972 4.4301 3.9846 4.2810 3.8772 3.9666 4.0228 3.9278 3.8470 3.8505 1.0839 1.0146 1.0075 1.0156 1.0126 1.0157 0.9888 1.0727 0.9923 0.9926 1.0075 0.9988 0.9966 0.9921 1.0177 1.0006 0.9962 0.9911 0.9955 0.9936 0.9961 1.0197
dispcorr: -0.038159208 hartree
energy: -2073.026224473514
dipole: -3.62862 3.03095 -0.59767 15.27287 -14.29981 0.97306 -14.13126 11.89532 -2.23594
magnitude: 2.51067 au
magnitude: 6.38162 debye
