program: Gaussian 09
title: 000074193
version: EM64L-G09RevD.01
frameworkgroup: C1[X(C13H9ClO2)]
method: RPBEPBE
basis: SDD
operation: Freq
keyword: #p
keyword: freq=noraman
keyword: PBEPBE/SDD
title: #p freq=noraman PBEPBE/SDD
converged: YES YES NO NO
title: Mulliken charges:
elementType: Cl O O C C C C C C C C C C C C C H H H H H H H H H
charge: -0.120140 -0.293881 -0.117753 0.338661 0.342579 -0.337951 -0.368647 0.415695 -0.351018 -0.270815 -0.363022 -0.375632 -0.199211 -0.191170 -0.242309 -0.184363 0.276176 0.266232 0.271540 0.268973 0.267782 0.261180 0.235407 0.235712 0.235974
chargesum: 0.00000
title: Mulliken charges with hydrogens summed into heavy atoms:
elementType: Cl O O C C C C C C C C C C C C C
charge: -0.120140 -0.293881 -0.117753 0.338661 0.342579 -0.061775 -0.102415 0.415695 -0.079478 -0.001841 -0.095241 -0.114452 0.036196 0.044541 -0.006335 -0.184363
polarizability: 2.77162442e+02 -8.22145646e+00 1.35945578e+02 1.24005124e+01 2.38837204e+00 8.87103442e+01
1716.lowfreq: 0.0008 0.0024 0.0024 1.4625 4.9355 12.3394 24.4501 33.0391 58.1077
frequency: 23.9768 33.0070 58.1030 73.4206 105.8987 146.0348 209.2572 267.5906 278.2970 310.5240 369.9077 386.4615 409.7238 414.5429 470.3029 486.9475 492.4934 589.8204 602.3979 617.5027 624.9912 634.4235 692.5901 729.0518 739.9530 774.9966 829.4212 836.0160 841.0834 856.9714 860.5661 914.7151 970.8539 979.1604 987.2927 987.8857 993.2742 1001.3919 1019.4272 1076.4154 1123.5635 1151.7107 1172.0579 1174.0534 1184.2367 1213.4309 1235.4313 1298.9200 1308.5641 1370.6242 1384.3388 1433.8929 1441.6936 1470.0911 1484.8041 1568.7801 1594.4451 1601.8898 1615.8749 1707.6678 3135.7070 3144.5151 3154.1795 3157.2188 3165.6561 3167.0937 3174.5431 3177.4287 3184.5781
redmass: 6.1404 6.5285 6.5054 4.3418 7.3709 10.6257 5.9173 6.4530 6.0914 8.8083 6.4758 11.5850 2.8993 3.0041 3.9998 3.5372 6.6418 5.6304 6.5979 6.7530 4.8761 7.0753 2.2397 4.7281 3.1938 2.0495 1.9384 2.2940 1.2525 1.7737 4.8812 1.4145 1.3691 1.3300 1.4188 5.0924 1.3109 2.7553 2.1180 1.5060 1.2927 2.2129 1.1120 1.2106 1.4611 3.1995 3.6536 1.2823 1.3242 5.0439 8.7792 4.6611 2.2629 2.2549 2.4836 7.4974 6.1473 6.7653 6.4265 12.7994 1.0853 1.0890 1.0889 1.0935 1.0887 1.0969 1.0964 1.1006 1.0972
irintensity: 0.2928 0.0181 0.6975 0.5708 3.2961 2.0575 1.8105 0.7933 7.1792 17.7093 5.5640 9.3352 0.3097 0.7969 13.4526 11.3529 12.4011 5.6668 40.3008 36.0517 35.8033 0.4806 31.3453 34.2053 54.4839 73.2730 27.6666 48.5075 1.3499 88.3442 143.2001 5.6594 0.3070 0.5460 0.2321 5.8522 0.5277 0.6541 16.1581 11.5658 19.5895 4.1833 40.2995 197.3446 156.3453 71.8422 560.5672 3.9313 0.8794 8.4003 0.2035 6.0140 4.0093 171.9005 69.2474 15.3526 166.8363 128.1614 147.7350 321.8513 1.6161 7.2009 1.6466 22.5204 0.4257 13.4871 2.3608 8.3435 2.9823
temp: 298.150 k
press: 1.00000 atm
elementType: 17 8 8 6 6 6 6 6 6 6 6 6 6 6 6 6 1 1 1 1 1 1 1 1 1
symmnumber: 1
zpe: 476674.1 jmol-1
zpe.correction: 0.181556 hartree
zpe.thermalcorrener: 0.195009 hartree
zpe.thermalcorrenthalpy: 0.195953 hartree
zpe.thermalcorrgfe: 0.138905 hartree
zpe.sumelectzpe: -1110.184915 hartree
zpe.sumelectthermal: -1110.171462 hartree
zpe.sumelectthermalent: -1110.170517 hartree
zpe.sumelectthermalfe: -1110.227565 hartree
dipole: -6.4159 -0.3284 0.1654
dipole: 6.4264
quadrupole: -110.3525 -97.7079 -97.3109
quadrupole: -11.5586 3.7031 3.0960
quadrupole: -8.5620 4.0825 4.4795 -11.5586 3.7031 3.0960
hfenergy: -1110.3664703 hartree
pointgroup: C01 [X(C13H9Cl1O2)]
dipole: 2.5255666 -0.018945 0.1171074 debye
dipolederiv: -0.9207936 0.3479179 0.12175 0.5957384 -0.5369457 -0.13005 0.2052538 -0.1297719 -0.2063319 -2.6377239 0.1606863 -0.0832408 0.1006391 -0.3902922 0.0043251 0.2131135 -0.0297963 -0.2168539 -0.8450832 -0.2038196 -0.0617765 -0.3916033 -1.0703886 -0.2746372 -0.1148849 -0.2617809 -0.3234363 2.2044739 0.0474701 0.109453 0.650316 0.2450914 0.1004102 -0.045806 0.0893271 0.1457913 1.5042148 -0.3123561 0.0139681 -0.9460315 0.2687739 -0.0979536 -0.1736415 -0.0334504 0.1463184 -0.5487954 -0.1027254 -0.0575058 -0.6240738 -0.1900567 -0.0247961 -0.1500963 -0.0053168 -0.1596827 -0.8290807 0.0364376 -0.0209072 0.2773943 0.0724661 0.0721436 0.0416369 0.0649258 -0.1468145 -1.4031724 -0.1317194 -0.0426021 -0.1217582 -0.2376102 -0.0814975 0.0102714 -0.0697411 -0.0446639 0.5831136 0.0939445 0.0262576 -0.1881696 0.0717786 0.0561905 -0.0884962 0.0460591 -0.064711 0.428631 0.0322533 0.0122647 0.3915396 0.0766937 0.059034 0.1166314 0.0501073 -0.0718467 -0.2863554 0.0065113 -0.0628862 0.2155973 -0.1651256 -0.0156954 -0.1382476 0.0098075 -0.0909512 -0.3634784 0.0299198 -0.0248116 0.0563961 -0.0298507 -0.0669326 0.041564 -0.1069283 -0.071148 0.0396714 -0.0419872 -0.0493801 -0.0818271 0.0303303 -0.1220324 -0.0351359 -0.1300815 0.0143087 0.0643848 -0.0334787 -0.0954217 -0.026438 -0.0397781 -0.0868332 -0.1367059 -0.072064 0.0018094 -0.0405789 -0.1097395 -0.0083474 -0.0782217 -0.076653 -0.0187416 0.0117785 -0.0207969 -0.149824 2.6125127 -0.0267097 -0.031117 -0.1153294 1.4910218 0.4348243 -0.0813066 0.4197417 0.3267226 0.0313609 0.0579225 0.0320845 0.0885917 0.0489888 -0.0278828 0.0680779 -0.0282065 0.1395964 0.0863034 -0.0446085 -0.0079648 -0.0467744 0.0005514 -0.0538477 -0.011344 -0.0528257 0.1490618 0.0958326 -0.0462543 -0.0186056 -0.0081774 0.0147925 -0.0479298 -0.0191688 -0.0419446 0.1363581 0.0698739 0.0729359 0.0246304 0.0384679 0.0765143 -0.0263419 0.0196495 -0.0230848 0.1452014 0.0308468 -0.0001209 0.0971943 -0.0044898 0.107603 0.0306454 0.1447108 0.0242118 0.0760434 0.1450968 0.0451153 -0.000001 0.042253 0.0437908 0.0984868 -0.0052423 0.0943276 0.0692202 0.0710871 0.0265535 0.0067796 0.0567038 0.0176586 0.1249407 -0.0145178 0.1216535 0.0295013 -0.0382029 -0.0111786 0.1052621 -0.005303 0.1081713 0.0564113 0.121945 0.0521857 0.0417456 -0.054139 0.10703 0.0149237 0.1245604 0.0624742 0.03776 0.0199611 0.0334425 0.1245855 unknown
polarizability: 276.2059693|-15.8772104|137.4216107|-9.148285|-0.3731941|88.1907842 unknown
InChI: InChI=1S/C13H9ClO2/c14-13(15)10-6-8-12(9-7-10)16-11-4-2-1-3-5-11/h1-9H
charge 0 multiplicity 1
25 atoms
Cl -5.527443 0.791824 0.175183
O  1.211377 1.279819 0.111304
O  -4.558791 -1.631728 -0.623667
C  -0.092448 0.774001 0.033357
C  2.344101 0.40972 0.124672
C  -0.406035 -0.545033 -0.388739
C  -1.119907 1.697152 0.352311
C  -2.798631 -0.015311 -0.153871
C  -1.752573 -0.929051 -0.480469
C  -2.462741 1.303581 0.259735
C  2.465912 -0.622357 1.081719
C  3.381639 0.705231 -0.781887
C  3.655233 -1.384028 1.111384
C  4.567493 -0.062576 -0.736864
C  4.705997 -1.109701 0.20395
C  -4.180021 -0.512293 -0.276073
H  0.388658 -1.248446 -0.651912
H  -0.841401 2.70654 0.667203
H  -2.015978 -1.938993 -0.811215
H  -3.261205 2.008065 0.50738
H  1.657649 -0.814721 1.794798
H  3.25291 1.523192 -1.496821
H  3.762515 -2.184798 1.850941
H  5.38011 0.1588 -1.436899
H  5.626282 -1.702187 0.23508
