program: Orca
programVersion: 4.2.1
elementType: S F O O O O O O O O N N N N N C C C C C C C C C C C C C C C C C C H H H H H H H H H H H H H H H H H H H H H H
charge: 0
multiplicity: 1
keywords: wb97x-d3
keywords: def2-TZVPP
keywords: def2/J RIJCOSX GRIDX6 NOFINALGRIDX
keywords: grid4 nofinalgrid
keywords: scfconv7
keywords: smallprint printgap noloewdin
keywords: NOSOSCF
formula: C18H22FN5O8S
InChI: InChI=1S/C18H22FN5O8S/c1-10(19)16(32-14(25)9-29-2)15-11(6-5-7-20-15)33(27,28)24-18(26)23-17-21-12(30-3)8-13(22-17)31-4/h5-8,10,16,23-24H,9H2,1-4H3
55 atoms
S  2.125071 -1.816642 1.359258
F  1.641479 2.76488 1.981183
O  0.775182 1.983107 -0.557809
O  2.259564 -0.861124 2.4438
O  2.696653 -3.135894 1.495759
O  -2.11347 1.677843 -2.555978
O  -0.253125 0.173603 -1.367364
O  0.575837 -3.384135 -0.613457
O  -2.198748 1.244521 2.606723
O  -4.918915 0.38605 -1.050588
N  2.886885 0.677258 -1.704208
N  0.483164 -1.926325 1.125921
N  -1.385378 -2.344479 -0.185262
N  -1.775668 -0.558818 1.26086
N  -3.185645 -1.01614 -0.574379
C  1.610476 1.176715 0.259321
C  2.433748 0.203297 -0.556862
C  2.491166 2.114355 1.081391
C  2.725177 -1.105137 -0.154278
C  3.262543 3.150849 0.304659
C  3.497861 -1.914742 -0.974158
C  3.965326 -1.396506 -2.166774
C  3.627125 -0.094034 -2.487294
C  -0.174412 1.365677 -1.257629
C  -0.059234 -2.604895 0.060446
C  -1.128984 2.36388 -1.853566
C  -2.144153 -1.255748 0.196333
C  -3.128186 2.536024 -3.017498
C  -2.505662 0.51566 1.548226
C  -3.884654 0.071922 -0.294221
C  -3.585128 0.908225 0.775872
C  -1.146441 0.826224 3.468496
C  -5.223784 -0.43957 -2.170257
H  0.972027 0.640352 0.9612
H  3.175208 1.499972 1.669194
H  3.818629 3.781742 0.998148
H  3.986858 2.677923 -0.355652
H  2.616436 3.788293 -0.297345
H  3.731642 -2.931913 -0.69431
H  4.57039 -1.992608 -2.834259
H  -0.131241 -1.268783 1.626403
H  3.965834 0.349301 -3.415925
H  -0.564554 3.061305 -2.490725
H  -1.54414 2.968155 -1.033081
H  -3.655095 3.032829 -2.195059
H  -2.738716 3.311783 -3.687394
H  -3.845511 1.936973 -3.576537
H  -4.165833 1.790416 1.002619
H  -1.290266 -0.193451 3.825482
H  -0.168962 0.913804 2.992271
H  -1.172808 1.505858 4.316184
H  -5.542405 -1.435179 -1.859106
H  -6.045858 0.052761 -2.683431
H  -4.377194 -0.533712 -2.849797
H  -1.748482 -2.834813 -0.992458
elementType: S F O N C H
totalener: -2072.98796820 hartree
nucrepener: 4218.81832395 hartree
electener: -6291.80629215 hartree
twoeener: 4949.50577760 hartree
cpcmener: -0.04469836 hartree
kineticenergy: 2065.46060038 hartree
xcener: -172.090108386138 hartree
chargesum: -0.0000000
charge: 0.870053 -0.266146 -0.286732 -0.502083 -0.482931 -0.336259 -0.404946 -0.445712 -0.286665 -0.291125 -0.388548 -0.194842 -0.145395 -0.430813 -0.383050 0.300084 0.183377 0.225633 -0.162317 -0.283626 -0.023552 -0.140764 0.023381 0.399932 0.349392 -0.023223 0.334254 -0.126008 0.425228 0.418963 -0.334784 -0.117307 -0.141322 -0.024191 0.085499 0.106009 0.094345 0.097162 0.153551 0.165928 0.213710 0.147742 0.133695 0.112147 0.098887 0.112149 0.111226 0.137256 0.126004 0.091611 0.140543 0.126567 0.137263 0.112986 0.187763
qa: 0.8701 -0.2661 -0.2867 -0.5021 -0.4829 -0.3363 -0.4049 -0.4457 -0.2867 -0.2911 -0.3885 -0.1948 -0.1454 -0.4308 -0.3831 0.3001 0.1834 0.2256 -0.1623 -0.2836 -0.0236 -0.1408 0.0234 0.3999 0.3494 -0.0232 0.3343 -0.1260 0.4252 0.4190 -0.3348 -0.1173 -0.1413 -0.0242 0.0855 0.1060 0.0943 0.0972 0.1536 0.1659 0.2137 0.1477 0.1337 0.1121 0.0989 0.1121 0.1112 0.1373 0.1260 0.0916 0.1405 0.1266 0.1373 0.1130 0.1878
va: 5.8209 1.0018 2.1460 1.9758 2.0205 1.9497 2.1003 2.0678 2.1315 2.1158 2.9652 3.0555 3.1659 2.9258 2.9245 3.7855 3.7676 3.9103 3.8334 3.9656 3.9142 3.8916 4.0393 4.0781 4.4346 4.0171 4.3025 3.9013 3.9464 3.9852 3.9136 3.8507 3.8482 1.0965 1.0139 1.0068 1.0124 1.0126 1.0168 0.9885 1.0658 0.9933 1.0000 0.9882 0.9910 0.9942 0.9891 1.0204 0.9919 0.9947 0.9954 0.9975 0.9892 0.9941 1.0202
dispcorr: -0.040209763 hartree
energy: -2073.028177963884
dipole: -11.34116 10.18395 -1.15721 16.77263 -14.53681 2.23582 -12.23751 10.38991 -1.84761
magnitude: 3.12277 au
magnitude: 7.93744 debye
