program: Orca
programVersion: 4.2.1
elementType: S F O O O O O O O O N N N N N C C C C C C C C C C C C C C C C C C H H H H H H H H H H H H H H H H H H H H H H
charge: 0
multiplicity: 1
keywords: wb97x-d3
keywords: def2-TZVPP
keywords: def2/J RIJCOSX GRIDX6 NOFINALGRIDX
keywords: grid4 nofinalgrid
keywords: scfconv7
keywords: smallprint printgap noloewdin
keywords: NOSOSCF
formula: C18H22FN5O8S
InChI: InChI=1S/C18H22FN5O8S/c1-10(19)16(32-14(25)9-29-2)15-11(6-5-7-20-15)33(27,28)24-18(26)23-17-21-12(30-3)8-13(22-17)31-4/h5-8,10,16,23-24H,9H2,1-4H3
55 atoms
S  1.936302 -1.687054 1.326917
F  3.730019 1.533885 1.579536
O  1.119141 2.189557 -0.712143
O  1.997936 -0.741959 2.425643
O  2.408099 -3.039574 1.521166
O  -1.531901 2.109298 -3.087005
O  -0.146814 0.469257 -1.367598
O  0.540253 -3.10328 -0.861838
O  -2.661161 0.973691 2.69464
O  -5.599801 -0.256054 -0.678773
N  3.214675 0.730367 -1.623798
N  0.330049 -1.69898 0.910018
N  -1.478437 -2.174664 -0.461883
N  -2.038809 -0.585026 1.142987
N  -3.53774 -1.22424 -0.562445
C  1.821933 1.359164 0.201972
C  2.609342 0.295403 -0.531476
C  2.768016 2.310893 0.943513
C  2.745295 -1.029796 -0.111477
C  2.063018 3.16672 1.962699
C  3.525146 -1.902749 -0.856564
C  4.152689 -1.427591 -1.992236
C  3.960237 -0.101679 -2.336116
C  0.162251 1.626196 -1.44698
C  -0.147588 -2.373136 -0.183525
C  -0.442172 2.632533 -2.400862
C  -2.382136 -1.285618 0.073292
C  -2.728772 2.132175 -2.342605
C  -2.946434 0.259636 1.621029
C  -4.429194 -0.371893 -0.079661
C  -4.191147 0.422388 1.036424
C  -1.39204 0.816923 3.317906
C  -5.868087 -1.058457 -1.825424
H  1.110677 0.926125 0.904809
H  3.285919 2.927827 0.204996
H  1.277492 3.758029 1.493371
H  1.611061 2.556683 2.746087
H  2.760801 3.861143 2.430325
H  3.646028 -2.935056 -0.561685
H  4.77064 -2.073554 -2.598784
H  -0.319691 -1.068407 1.400493
H  4.427634 0.310322 -3.22232
H  0.328697 2.898739 -3.131049
H  -0.684323 3.552587 -1.85287
H  -3.054494 3.15589 -2.130709
H  -3.497957 1.646603 -2.940718
H  -2.646252 1.601457 -1.390449
H  -4.926127 1.111888 1.425291
H  -1.213853 -0.211189 3.634331
H  -0.582339 1.151034 2.667164
H  -1.413216 1.456626 4.196153
H  -5.851638 -2.121891 -1.586636
H  -6.867006 -0.779833 -2.150276
H  -5.161581 -0.863051 -2.632397
H  -1.809016 -2.673611 -1.27722
elementType: S F O N C H
totalener: -2072.98959776 hartree
nucrepener: 4149.02562401 hartree
electener: -6222.01522177 hartree
twoeener: 4879.26543611 hartree
cpcmener: -0.04809679 hartree
kineticenergy: 2065.46851322 hartree
xcener: -172.089559622865 hartree
chargesum: 0.0000000
charge: 0.860777 -0.259902 -0.280266 -0.497153 -0.490728 -0.366927 -0.419904 -0.453202 -0.289644 -0.289285 -0.390736 -0.193547 -0.129263 -0.418237 -0.403736 0.214029 0.255128 0.199139 -0.139904 -0.290320 -0.024388 -0.143577 0.020592 0.385639 0.354615 0.040967 0.355014 -0.070641 0.430248 0.373796 -0.313211 -0.107275 -0.113892 -0.020102 0.100292 0.104164 0.083321 0.111365 0.152960 0.164532 0.207445 0.146685 0.130161 0.112820 0.108473 0.117110 0.037464 0.141980 0.124350 0.086153 0.142314 0.115658 0.132137 0.108447 0.188063
qa: 0.8608 -0.2599 -0.2803 -0.4972 -0.4907 -0.3669 -0.4199 -0.4532 -0.2896 -0.2893 -0.3907 -0.1935 -0.1293 -0.4182 -0.4037 0.2140 0.2551 0.1991 -0.1399 -0.2903 -0.0244 -0.1436 0.0206 0.3856 0.3546 0.0410 0.3550 -0.0706 0.4302 0.3738 -0.3132 -0.1073 -0.1139 -0.0201 0.1003 0.1042 0.0833 0.1114 0.1530 0.1645 0.2074 0.1467 0.1302 0.1128 0.1085 0.1171 0.0375 0.1420 0.1243 0.0862 0.1423 0.1157 0.1321 0.1084 0.1881
va: 5.8350 1.0019 2.1418 1.9829 2.0120 1.9527 2.1076 2.0659 2.1454 2.1227 2.9713 3.0604 3.1769 2.9602 2.9352 3.8933 3.6267 3.8747 3.8185 3.9697 3.9102 3.9022 4.0512 4.0306 4.4289 3.9640 4.2406 3.9149 3.9635 4.0366 3.9028 3.8616 3.8529 1.0742 1.0100 1.0107 1.0084 1.0066 1.0170 0.9887 1.0708 0.9941 0.9958 1.0002 0.9954 0.9907 0.9994 1.0186 0.9926 0.9825 0.9960 0.9960 0.9934 0.9942 1.0198
dispcorr: -0.037732908 hartree
energy: -2073.027330668447
dipole: -17.40919 15.34190 -2.06729 16.97191 -14.48712 2.48479 -5.57932 4.58825 -0.99106
magnitude: 3.38084 au
magnitude: 8.59342 debye
