program: Orca
programVersion: 4.2.1
elementType: S F O O O O O O O O N N N N N C C C C C C C C C C C C C C C C C C H H H H H H H H H H H H H H H H H H H H H H
charge: 0
multiplicity: 1
keywords: wb97x-d3
keywords: def2-TZVPP
keywords: def2/J RIJCOSX GRIDX6 NOFINALGRIDX
keywords: grid4 nofinalgrid
keywords: scfconv7
keywords: smallprint printgap noloewdin
keywords: NOSOSCF
formula: C18H22FN5O8S
InChI: InChI=1S/C18H22FN5O8S/c1-10(19)16(32-14(25)9-29-2)15-11(6-5-7-20-15)33(27,28)24-18(26)23-17-21-12(30-3)8-13(22-17)31-4/h5-8,10,16,23-24H,9H2,1-4H3
55 atoms
S  1.990977 -1.766626 1.35981
F  1.564323 2.819259 1.993312
O  1.043006 2.13145 -0.677116
O  2.051122 -0.818182 2.455594
O  2.506261 -3.101572 1.516366
O  -1.379419 2.162383 -3.296544
O  -0.197717 0.439503 -1.454067
O  0.56785 -3.088236 -0.905119
O  -2.548912 0.944343 2.792442
O  -5.514958 -0.155976 -0.600875
N  3.14007 0.734764 -1.58272
N  0.377498 -1.79957 0.962623
N  -1.44125 -2.168994 -0.429703
N  -1.959491 -0.598069 1.210506
N  -3.471836 -1.163037 -0.511437
C  1.683841 1.265305 0.243475
C  2.556268 0.265752 -0.491828
C  2.487542 2.129923 1.211261
C  2.749741 -1.057892 -0.086396
C  3.42792 3.125458 0.575275
C  3.547845 -1.894775 -0.850915
C  4.150818 -1.384354 -1.984418
C  3.911834 -0.059974 -2.305266
C  0.132041 1.591346 -1.4851
C  -0.098843 -2.400143 -0.177796
C  -0.401727 2.639394 -2.443055
C  -2.314694 -1.263995 0.12032
C  -2.642113 1.99757 -2.705157
C  -2.84748 0.257229 1.70685
C  -4.34497 -0.307198 -0.00484
C  -4.090917 0.456249 1.128236
C  -1.267563 0.793019 3.387224
C  -5.784625 -0.922923 -1.763809
H  0.923307 0.746977 0.827771
H  3.033649 1.456086 1.874251
H  4.183856 2.618491 -0.020942
H  2.902017 3.824016 -0.072159
H  3.938604 3.692506 1.35274
H  3.682433 -2.928141 -0.565872
H  4.778276 -2.002643 -2.609957
H  -0.262403 -1.179913 1.474185
H  4.358198 0.384055 -3.187628
H  0.438693 2.981077 -3.054327
H  -0.734587 3.509829 -1.857487
H  -3.342569 1.754306 -3.502655
H  -2.664637 1.187658 -1.972375
H  -2.987836 2.917219 -2.217394
H  -4.810809 1.150186 1.533627
H  -1.298975 1.378598 4.301699
H  -1.049633 -0.245517 3.637673
H  -0.474889 1.186467 2.75038
H  -6.781674 -0.630863 -2.082213
H  -5.071263 -0.714056 -2.561516
H  -5.767996 -1.992824 -1.555954
H  -1.767287 -2.589987 -1.286713
totalener: -2072.96381537 hartree
nucrepener: 4150.54696343 hartree
electener: -6223.51077879 hartree
twoeener: 4879.31087158 hartree
kineticenergy: 2065.52129886 hartree
xcener: -172.092265356200 hartree
chargesum: -0.0000000
charge: 0.855460 -0.246009 -0.277597 -0.475772 -0.429582 -0.307957 -0.386393 -0.369262 -0.260771 -0.262346 -0.358082 -0.200809 -0.146655 -0.410919 -0.387963 0.288043 0.139706 0.210374 -0.198217 -0.261566 -0.000094 -0.108652 0.008667 0.374514 0.339061 0.005194 0.348711 -0.091636 0.394340 0.345769 -0.287205 -0.130798 -0.122335 0.006344 0.079477 0.085556 0.094227 0.097219 0.143784 0.134214 0.194556 0.121204 0.115757 0.091791 0.104464 0.072634 0.084771 0.127196 0.128468 0.109854 0.114517 0.124031 0.104145 0.110296 0.166279
qa: 0.8555 -0.2460 -0.2776 -0.4758 -0.4296 -0.3080 -0.3864 -0.3693 -0.2608 -0.2623 -0.3581 -0.2008 -0.1467 -0.4109 -0.3880 0.2880 0.1397 0.2104 -0.1982 -0.2616 -0.0001 -0.1087 0.0087 0.3745 0.3391 0.0052 0.3487 -0.0916 0.3943 0.3458 -0.2872 -0.1308 -0.1223 0.0063 0.0795 0.0856 0.0942 0.0972 0.1438 0.1342 0.1946 0.1212 0.1158 0.0918 0.1045 0.0726 0.0848 0.1272 0.1285 0.1099 0.1145 0.1240 0.1041 0.1103 0.1663
va: 5.8342 1.0303 2.1472 2.0053 2.0813 2.0144 2.1302 2.1466 2.1618 2.1382 2.9731 3.0700 3.1750 2.9502 2.9333 3.7841 3.7714 3.9270 3.9431 3.9549 3.9281 3.8681 4.0626 4.0186 4.4126 3.9811 4.2435 3.9430 4.0187 4.0642 3.9201 3.8600 3.8772 1.0753 1.0180 1.0161 1.0156 1.0080 1.0232 0.9995 1.0792 0.9983 0.9996 1.0040 0.9971 0.9934 0.9956 1.0226 0.9977 0.9937 1.0036 0.9935 0.9948 0.9979 1.0372
dispcorr: -0.037902804 hartree
energy: -2073.001718169929
dipole: -9.50142 8.82729 -0.67413 13.57926 -12.63201 0.94725 -9.88963 8.95807 -0.93156
magnitude: 1.48982 au
magnitude: 3.78681 debye
