program: Orca
programVersion: 4.2.1
elementType: S F O O O O O O O O N N N N N C C C C C C C C C C C C C C C C C C H H H H H H H H H H H H H H H H H H H H H H
charge: 0
multiplicity: 1
keywords: wb97x-d3
keywords: def2-TZVPP
keywords: def2/J RIJCOSX GRIDX6 NOFINALGRIDX
keywords: grid4 nofinalgrid
keywords: scfconv7
keywords: smallprint printgap noloewdin
keywords: NOSOSCF
formula: C18H22FN5O8S
InChI: InChI=1S/C18H22FN5O8S/c1-10(19)16(32-14(25)9-29-2)15-11(6-5-7-20-15)33(27,28)24-18(26)23-17-21-12(30-3)8-13(22-17)31-4/h5-8,10,16,23-24H,9H2,1-4H3
55 atoms
S  1.947114 -1.734735 1.355969
F  1.315262 2.785378 1.979931
O  0.713966 2.07476 -0.694926
O  1.982235 -0.766027 2.434465
O  2.547288 -3.033373 1.516843
O  -0.267229 3.666363 -2.58722
O  -0.471938 0.315587 -1.396579
O  0.555615 -3.181608 -0.847064
O  -2.707275 0.761849 2.822981
O  -5.626771 -0.488474 -0.558478
N  2.851534 0.770936 -1.668922
N  0.330047 -1.871763 1.002417
N  -1.491784 -2.367187 -0.345968
N  -2.064501 -0.788918 1.269149
N  -3.554211 -1.430921 -0.445767
C  1.436194 1.255424 0.206889
C  2.333852 0.293465 -0.548051
C  2.232507 2.178459 1.127596
C  2.621095 -1.007395 -0.124163
C  3.037204 3.251252 0.432968
C  3.445476 -1.810191 -0.896883
C  3.981418 -1.289216 -2.059109
C  3.648672 0.009118 -2.400153
C  -0.197674 1.484533 -1.452882
C  -0.135329 -2.518974 -0.117822
C  -0.907754 2.456942 -2.379713
C  -2.396633 -1.481502 0.188829
C  0.856348 3.578267 -3.428014
C  -2.979613 0.048119 1.747519
C  -4.453644 -0.591507 0.04131
C  -4.22564 0.199954 1.160696
C  -1.423404 0.664173 3.422683
C  -5.867564 -1.280365 -1.710646
H  0.729927 0.705598 0.828971
H  2.879444 1.550798 1.743686
H  3.779119 2.811117 -0.230791
H  2.404063 3.911569 -0.156676
H  3.564583 3.849619 1.175144
H  3.652544 -2.826736 -0.595221
H  4.627844 -1.881164 -2.690807
H  -0.333391 -1.278219 1.515998
H  4.03735 0.459046 -3.306499
H  -1.880492 2.671414 -1.924799
H  -1.112604 1.913118 -3.312833
H  0.591571 3.184562 -4.417772
H  1.243292 4.587823 -3.556897
H  1.65214 2.953373 -3.009905
H  -4.966512 0.880712 1.550404
H  -1.169744 -0.362491 3.688348
H  -0.642951 1.076416 2.782447
H  -1.477736 1.261425 4.328521
H  -5.158152 -1.060157 -2.508849
H  -5.818105 -2.346401 -1.487192
H  -6.872189 -1.024685 -2.03684
H  -1.808392 -2.818428 -1.191026
totalener: -2072.96319549 hartree
nucrepener: 4134.10213791 hartree
electener: -6207.06533340 hartree
twoeener: 4863.00777183 hartree
kineticenergy: 2065.51723848 hartree
xcener: -172.091096081817 hartree
chargesum: 0.0000000
charge: 0.855763 -0.244233 -0.251267 -0.472959 -0.430039 -0.309259 -0.400603 -0.372116 -0.260606 -0.264258 -0.367924 -0.202203 -0.154062 -0.418352 -0.394901 0.271488 0.154844 0.224517 -0.214118 -0.268024 0.005462 -0.112045 0.021469 0.365511 0.341788 0.018245 0.356388 -0.114468 0.394314 0.381858 -0.303434 -0.131685 -0.126192 0.006197 0.076003 0.084004 0.097357 0.099618 0.143941 0.134615 0.196123 0.118577 0.098939 0.091587 0.088914 0.110632 0.087655 0.128114 0.108987 0.116127 0.128277 0.108419 0.108569 0.123126 0.165320
qa: 0.8558 -0.2442 -0.2513 -0.4730 -0.4300 -0.3093 -0.4006 -0.3721 -0.2606 -0.2643 -0.3679 -0.2022 -0.1541 -0.4184 -0.3949 0.2715 0.1548 0.2245 -0.2141 -0.2680 0.0055 -0.1120 0.0215 0.3655 0.3418 0.0182 0.3564 -0.1145 0.3943 0.3819 -0.3034 -0.1317 -0.1262 0.0062 0.0760 0.0840 0.0974 0.0996 0.1439 0.1346 0.1961 0.1186 0.0989 0.0916 0.0889 0.1106 0.0877 0.1281 0.1090 0.1161 0.1283 0.1084 0.1086 0.1231 0.1653
va: 5.8375 1.0331 2.1839 2.0083 2.0811 1.9964 2.1178 2.1436 2.1604 2.1484 2.9865 3.0702 3.1716 2.9504 2.9609 3.7843 3.7777 3.9143 3.9190 3.9471 3.9199 3.8889 4.0390 4.0027 4.4103 4.0078 4.2528 3.9052 4.0140 4.0589 3.9266 3.8607 3.8778 1.0763 1.0179 1.0174 1.0134 1.0095 1.0233 0.9998 1.0784 0.9980 0.9968 1.0081 0.9971 0.9950 0.9938 1.0223 0.9932 1.0022 0.9977 0.9970 0.9971 0.9938 1.0381
dispcorr: -0.037239617 hartree
energy: -2073.000435105111
dipole: -2.88730 2.46131 -0.42599 14.88958 -14.33611 0.55347 -13.68249 12.10746 -1.57503
magnitude: 1.72294 au
magnitude: 4.37936 debye
