program: Orca
programVersion: 4.2.1
elementType: S F O O O O O O O O N N N N N C C C C C C C C C C C C C C C C C C H H H H H H H H H H H H H H H H H H H H H H
charge: 0
multiplicity: 1
keywords: wb97x-d3
keywords: def2-TZVPP
keywords: def2/J RIJCOSX GRIDX6 NOFINALGRIDX
keywords: grid4 nofinalgrid
keywords: scfconv7
keywords: smallprint printgap noloewdin
keywords: NOSOSCF
formula: C18H22FN5O8S
InChI: InChI=1S/C18H22FN5O8S/c1-10(19)16(32-14(25)9-29-2)15-11(6-5-7-20-15)33(27,28)24-18(26)23-17-21-12(30-3)8-13(22-17)31-4/h5-8,10,16,23-24H,9H2,1-4H3
55 atoms
S  1.945721 -1.734697 1.352662
F  1.307408 2.780404 1.977935
O  0.718118 2.076265 -0.701557
O  1.983457 -0.765722 2.430641
O  2.544482 -3.033941 1.513089
O  -0.252104 3.672244 -2.595243
O  -0.478127 0.32319 -1.401969
O  0.54978 -3.185329 -0.8438
O  -2.708782 0.76764 2.8222
O  -5.634941 -0.498829 -0.547873
N  2.854849 0.770848 -1.671081
N  0.327776 -1.869458 1.00158
N  -1.49636 -2.368424 -0.341622
N  -2.066585 -0.786276 1.27101
N  -3.559918 -1.435638 -0.438108
C  1.435124 1.254405 0.202018
C  2.334353 0.292814 -0.551672
C  2.228084 2.174706 1.128344
C  2.618805 -1.008992 -0.128733
C  3.03596 3.248756 0.439468
C  3.441029 -1.81317 -0.902398
C  3.978718 -1.292195 -2.063789
C  3.651013 0.008106 -2.402446
C  -0.196082 1.490205 -1.459795
C  -0.139579 -2.519814 -0.115545
C  -0.899149 2.466029 -2.38855
C  -2.400696 -1.482656 0.193656
C  0.87167 3.578778 -3.435223
C  -2.98206 0.050452 1.7493
C  -4.459819 -0.59678 0.049003
C  -4.230199 0.198215 1.165523
C  -1.424031 0.673388 3.420641
C  -5.87528 -1.294339 -1.697714
H  0.725241 0.703462 0.819081
H  2.871824 1.545383 1.745916
H  3.55897 3.846407 1.185258
H  3.781557 2.809906 -0.22107
H  2.405492 3.909509 -0.152656
H  3.644939 -2.830735 -0.601986
H  4.623069 -1.885275 -2.696557
H  -0.334917 -1.274484 1.51491
H  4.042412 0.458663 -3.307358
H  -1.872027 2.6856 -1.93641
H  -1.104199 1.922913 -3.322045
H  1.66626 2.95458 -3.014042
H  0.606656 3.181024 -4.423285
H  1.259909 4.587196 -3.568581
H  -4.971334 0.878447 1.555697
H  -0.644673 1.08406 2.778035
H  -1.477933 1.273902 4.324367
H  -1.169057 -0.352149 3.689762
H  -5.815341 -2.359695 -1.473483
H  -6.883787 -1.047759 -2.019163
H  -5.171905 -1.068931 -2.499965
H  -1.816552 -2.823214 -1.183416
totalener: -2072.96325166 hartree
nucrepener: 4132.74778058 hartree
electener: -6205.71103224 hartree
twoeener: 4861.65559585 hartree
kineticenergy: 2065.51567712 hartree
xcener: -172.090724315178 hartree
chargesum: -0.0000000
charge: 0.855807 -0.244416 -0.251191 -0.472965 -0.429829 -0.309299 -0.400390 -0.372363 -0.260627 -0.264315 -0.367431 -0.202395 -0.153792 -0.418437 -0.395408 0.270496 0.154609 0.224735 -0.213877 -0.267925 0.005308 -0.112103 0.021557 0.365231 0.341736 0.017639 0.356892 -0.114444 0.394260 0.381913 -0.303262 -0.131582 -0.126089 0.006580 0.076278 0.099616 0.083880 0.097384 0.144039 0.134632 0.196276 0.118583 0.099218 0.091543 0.087859 0.088720 0.110664 0.128121 0.115931 0.128213 0.109004 0.108462 0.123099 0.108483 0.165372
qa: 0.8558 -0.2444 -0.2512 -0.4730 -0.4298 -0.3093 -0.4004 -0.3724 -0.2606 -0.2643 -0.3674 -0.2024 -0.1538 -0.4184 -0.3954 0.2705 0.1546 0.2247 -0.2139 -0.2679 0.0053 -0.1121 0.0216 0.3652 0.3417 0.0176 0.3569 -0.1144 0.3943 0.3819 -0.3033 -0.1316 -0.1261 0.0066 0.0763 0.0996 0.0839 0.0974 0.1440 0.1346 0.1963 0.1186 0.0992 0.0915 0.0879 0.0887 0.1107 0.1281 0.1159 0.1282 0.1090 0.1085 0.1231 0.1085 0.1654
va: 5.8375 1.0329 2.1835 2.0085 2.0813 1.9963 2.1180 2.1435 2.1604 2.1485 2.9871 3.0706 3.1715 2.9508 2.9609 3.7855 3.7779 3.9129 3.9179 3.9475 3.9203 3.8891 4.0388 4.0033 4.4105 4.0077 4.2519 3.9051 4.0141 4.0590 3.9265 3.8605 3.8778 1.0758 1.0181 1.0095 1.0174 1.0135 1.0233 0.9998 1.0782 0.9980 0.9968 1.0081 0.9937 0.9971 0.9950 1.0223 1.0026 0.9978 0.9932 0.9972 0.9938 0.9969 1.0380
dispcorr: -0.037199529 hartree
energy: -2073.000451185980
dipole: -2.85185 2.42810 -0.42374 14.88319 -14.33311 0.55008 -13.66217 12.09204 -1.57013
magnitude: 1.71681 au
magnitude: 4.36379 debye
