program: Orca
programVersion: 4.2.1
elementType: S F O O O O O O O O N N N N N C C C C C C C C C C C C C C C C C C H H H H H H H H H H H H H H H H H H H H H H
charge: 0
multiplicity: 1
keywords: wb97x-d3
keywords: def2-TZVPP
keywords: def2/J RIJCOSX GRIDX6 NOFINALGRIDX
keywords: grid4 nofinalgrid
keywords: scfconv7
keywords: smallprint printgap noloewdin
keywords: NOSOSCF
formula: C18H22FN5O8S
InChI: InChI=1S/C18H22FN5O8S/c1-10(19)16(32-14(25)9-29-2)15-11(6-5-7-20-15)33(27,28)24-18(26)23-17-21-12(30-3)8-13(22-17)31-4/h5-8,10,16,23-24H,9H2,1-4H3
55 atoms
S  2.043607 -1.72429 1.422002
F  1.324989 2.846537 1.737477
O  0.750471 1.923068 -0.843509
O  2.067744 -0.689582 2.43797
O  2.651862 -3.005871 1.664414
O  -1.06765 3.484414 -2.027631
O  -0.273219 0.061518 -1.531157
O  0.655188 -3.35701 -0.654513
O  -2.53786 1.089941 2.460536
O  -5.255235 -0.19489 -1.071889
N  2.964551 0.624137 -1.723057
N  0.424602 -1.89802 1.078677
N  -1.375719 -2.434016 -0.288416
N  -1.926547 -0.665146 1.125166
N  -3.318549 -1.325903 -0.663836
C  1.512001 1.185055 0.097489
C  2.432021 0.197305 -0.590262
C  2.273789 2.195885 0.95097
C  2.716672 -1.080084 -0.096441
C  3.063696 3.231157 0.18713
C  3.548309 -1.919209 -0.821293
C  4.094158 -1.454492 -2.002951
C  3.769946 -0.171732 -2.407196
C  -0.144856 1.256452 -1.554543
C  -0.031068 -2.614586 -0.003039
C  -0.984547 2.164064 -2.437413
C  -2.231059 -1.423168 0.080502
C  -1.849899 3.674699 -0.87594
C  -2.783539 0.303986 1.429428
C  -4.158708 -0.353384 -0.351471
C  -3.942843 0.526433 0.703093
C  -1.368623 0.879727 3.239822
C  -5.479267 -1.07571 -2.161786
H  0.82473 0.659056 0.759707
H  2.922925 1.634801 1.626073
H  3.834195 2.760669 -0.420275
H  2.427091 3.818362 -0.471765
H  3.553536 3.905669 0.888653
H  3.754673 -2.918995 -0.46746
H  4.745843 -2.076632 -2.599322
H  -0.2319 -1.247028 1.524242
H  4.172759 0.2362 -3.327239
H  -1.968481 1.683777 -2.53507
H  -0.527479 2.155837 -3.432192
H  -2.856283 3.252697 -0.990597
H  -1.397889 3.242186 0.02336
H  -1.943262 4.748054 -0.720299
H  -4.638064 1.312637 0.954175
H  -1.305304 -0.142164 3.614717
H  -0.46123 1.120038 2.686209
H  -1.451116 1.563187 4.08024
H  -6.417947 -0.757352 -2.607238
H  -4.682886 -1.011549 -2.903819
H  -5.56487 -2.111968 -1.834169
H  -1.67225 -2.93366 -1.113657
totalener: -2072.96137808 hartree
nucrepener: 4193.64888835 hartree
electener: -6266.61026643 hartree
twoeener: 4922.36500805 hartree
kineticenergy: 2065.51909132 hartree
xcener: -172.089665031191 hartree
chargesum: -0.0000000
charge: 0.857043 -0.248775 -0.254729 -0.473345 -0.427587 -0.306071 -0.392554 -0.366552 -0.263434 -0.265564 -0.352928 -0.200057 -0.162829 -0.415452 -0.383202 0.311062 0.131968 0.213795 -0.198797 -0.263876 0.002680 -0.111355 0.004658 0.352420 0.338600 0.013210 0.343838 -0.105610 0.416417 0.407472 -0.358978 -0.130813 -0.126609 -0.013793 0.083679 0.084859 0.100171 0.095459 0.144553 0.134501 0.197093 0.121714 0.097051 0.100558 0.083742 0.083121 0.114090 0.126759 0.113521 0.112221 0.128745 0.123777 0.108601 0.109438 0.166100
qa: 0.8570 -0.2488 -0.2547 -0.4733 -0.4276 -0.3061 -0.3926 -0.3666 -0.2634 -0.2656 -0.3529 -0.2001 -0.1628 -0.4155 -0.3832 0.3111 0.1320 0.2138 -0.1988 -0.2639 0.0027 -0.1114 0.0047 0.3524 0.3386 0.0132 0.3438 -0.1056 0.4164 0.4075 -0.3590 -0.1308 -0.1266 -0.0138 0.0837 0.0849 0.1002 0.0955 0.1446 0.1345 0.1971 0.1217 0.0971 0.1006 0.0837 0.0831 0.1141 0.1268 0.1135 0.1122 0.1287 0.1238 0.1086 0.1094 0.1661
va: 5.8345 1.0259 2.1752 2.0063 2.0845 2.0026 2.1154 2.1474 2.1443 2.1436 2.9927 3.0715 3.1702 2.9315 2.9396 3.7573 3.8062 3.9132 3.9400 3.9612 3.9267 3.8670 4.0658 3.9931 4.4163 3.9996 4.2752 3.9194 3.9526 4.0113 3.8961 3.8578 3.8778 1.0900 1.0174 1.0169 1.0158 1.0075 1.0233 0.9994 1.0755 0.9981 1.0003 0.9978 0.9928 0.9959 0.9980 1.0242 0.9944 0.9985 0.9975 0.9936 0.9959 0.9969 1.0376
dispcorr: -0.039273898 hartree
energy: -2073.000651975627
dipole: -9.42165 8.52490 -0.89675 15.36789 -14.73144 0.63645 -8.14549 6.96439 -1.18110
magnitude: 1.61377 au
magnitude: 4.10187 debye
