program: Orca
programVersion: 4.2.1
elementType: S F O O O O O O O O N N N N N C C C C C C C C C C C C C C C C C C H H H H H H H H H H H H H H H H H H H H H H
charge: 0
multiplicity: 1
keywords: wb97x-d3
keywords: def2-TZVPP
keywords: def2/J RIJCOSX GRIDX6 NOFINALGRIDX
keywords: grid4 nofinalgrid
keywords: scfconv7
keywords: smallprint printgap noloewdin
keywords: NOSOSCF
formula: C18H22FN5O8S
InChI: InChI=1S/C18H22FN5O8S/c1-10(19)16(32-14(25)9-29-2)15-11(6-5-7-20-15)33(27,28)24-18(26)23-17-21-12(30-3)8-13(22-17)31-4/h5-8,10,16,23-24H,9H2,1-4H3
55 atoms
S  2.042016 -1.724816 1.424335
F  1.316047 2.843597 1.741034
O  0.74803 1.921837 -0.842945
O  2.0649 -0.69073 2.440971
O  2.650649 -3.00628 1.666476
O  -1.071221 3.479289 -2.031628
O  -0.269041 0.058978 -1.536905
O  0.655213 -3.356345 -0.654693
O  -2.537773 1.090233 2.460758
O  -5.24734 -0.182428 -1.082053
N  2.965031 0.625882 -1.718458
N  0.423399 -1.898941 1.079683
N  -1.375551 -2.432123 -0.290266
N  -1.926489 -0.664076 1.12433
N  -3.314787 -1.318889 -0.669692
C  1.508118 1.18413 0.09945
C  2.430894 0.197876 -0.586856
C  2.266966 2.195206 0.955301
C  2.716268 -1.079357 -0.093062
C  3.056509 3.232491 0.193814
C  3.550072 -1.917204 -0.816899
C  4.097508 -1.45131 -1.997355
C  3.772628 -0.168693 -2.401504
C  -0.142454 1.25413 -1.559014
C  -0.031359 -2.614115 -0.00339
C  -0.978084 2.161119 -2.446397
C  -2.229695 -1.419814 0.077611
C  -1.86495 3.660147 -0.886344
C  -2.782213 0.306475 1.427731
C  -4.153554 -0.34483 -0.358336
C  -3.938891 0.532678 0.698374
C  -1.371846 0.87548 3.243827
C  -5.469268 -1.060141 -2.17491
H  0.819812 0.656865 0.759622
H  2.915919 1.634377 1.63078
H  2.420006 3.819583 -0.465276
H  3.544303 3.90688 0.896879
H  3.828616 2.763877 -0.413012
H  3.756994 -2.916897 -0.463127
H  4.750881 -2.07247 -2.5929
H  -0.23348 -1.248443 1.525434
H  4.17667 0.240186 -3.32059
H  -1.958733 1.676651 -2.555569
H  -0.511226 2.159409 -3.436671
H  -1.962186 4.732207 -0.724326
H  -2.869196 3.23668 -1.013562
H  -1.420823 3.222441 0.014445
H  -4.632979 1.320143 0.948641
H  -0.46171 1.112482 2.693352
H  -1.454604 1.559038 4.084131
H  -1.313711 -0.146766 3.618604
H  -4.669774 -0.996205 -2.913612
H  -5.558706 -2.096951 -1.850085
H  -6.405383 -0.738395 -2.623307
H  -1.67107 -2.929918 -1.116997
totalener: -2072.96134861 hartree
nucrepener: 4194.55772152 hartree
electener: -6267.51907013 hartree
twoeener: 4923.27131163 hartree
kineticenergy: 2065.51910421 hartree
xcener: -172.089639659913 hartree
chargesum: -0.0000000
charge: 0.856972 -0.248717 -0.254510 -0.473357 -0.427598 -0.305969 -0.392174 -0.366349 -0.263377 -0.265596 -0.353036 -0.199781 -0.162861 -0.415350 -0.382923 0.311854 0.132198 0.213504 -0.199043 -0.263973 0.002832 -0.111538 0.004773 0.351346 0.338288 0.013637 0.343356 -0.105540 0.416940 0.408218 -0.360388 -0.130705 -0.126620 -0.014096 0.083563 0.100143 0.095453 0.084851 0.144569 0.134509 0.197022 0.121708 0.096896 0.100822 0.114048 0.083842 0.082916 0.126836 0.112170 0.128727 0.113524 0.108515 0.109516 0.123797 0.166157
qa: 0.8570 -0.2487 -0.2545 -0.4734 -0.4276 -0.3060 -0.3922 -0.3663 -0.2634 -0.2656 -0.3530 -0.1998 -0.1629 -0.4153 -0.3829 0.3119 0.1322 0.2135 -0.1990 -0.2640 0.0028 -0.1115 0.0048 0.3513 0.3383 0.0136 0.3434 -0.1055 0.4169 0.4082 -0.3604 -0.1307 -0.1266 -0.0141 0.0836 0.1001 0.0955 0.0849 0.1446 0.1345 0.1970 0.1217 0.0969 0.1008 0.1140 0.0838 0.0829 0.1268 0.1122 0.1287 0.1135 0.1085 0.1095 0.1238 0.1662
va: 5.8346 1.0259 2.1752 2.0063 2.0845 2.0027 2.1155 2.1475 2.1444 2.1433 2.9925 3.0715 3.1701 2.9314 2.9392 3.7558 3.8052 3.9136 3.9402 3.9612 3.9266 3.8670 4.0657 3.9945 4.4165 3.9981 4.2756 3.9207 3.9508 4.0100 3.8965 3.8580 3.8778 1.0902 1.0175 1.0159 1.0075 1.0169 1.0233 0.9994 1.0756 0.9981 1.0005 0.9976 0.9980 0.9926 0.9956 1.0242 0.9983 0.9975 0.9943 0.9959 0.9969 0.9936 1.0376
dispcorr: -0.039308290 hartree
energy: -2073.000656901468
dipole: -9.43213 8.53678 -0.89535 15.35577 -14.71759 0.63818 -8.18320 6.99840 -1.18480
magnitude: 1.61638 au
magnitude: 4.10851 debye
