program: Orca
programVersion: 4.2.1
elementType: S F F F F O O O O O O O N N N N C C C C C C C C C C C C C C C H H H H H H H H H H H H
charge: 0
multiplicity: 1
keywords: wb97x-d3
keywords: def2-TZVPP
keywords: def2/J RIJCOSX GRIDX6 NOFINALGRIDX
keywords: grid4 nofinalgrid
keywords: scfconv7
keywords: smallprint printgap noloewdin
keywords: NOSOSCF
formula: C15H12F4N4O7S
InChI: InChI=1S/C15H12F4N4O7S/c1-28-11(24)7-4-2-3-5-8(7)31(26,27)23-15(25)22-14-20-9(29-12(16)17)6-10(21-14)30-13(18)19/h2-6,12-13,22-23H,1H3
43 atoms
S  -1.6292 -2.264901 0.890755
F  2.712155 4.842983 3.050514
F  3.241058 6.209691 1.46262
F  3.271035 -1.758324 -2.321662
F  2.360996 -2.120784 -0.397352
O  -2.079292 -2.699543 2.194712
O  -0.821812 -3.152783 0.075486
O  -1.628239 -2.722638 -3.028472
O  -0.748707 -0.932551 -2.01383
O  -2.223844 0.279205 2.230259
O  3.245831 4.096751 1.022138
O  3.255945 -0.134384 -0.898322
N  -0.680888 -0.903765 1.065264
N  -0.292974 1.305947 1.695305
N  1.477214 2.684839 1.36742
N  1.474242 0.543582 0.381968
C  -3.034884 -1.749631 -0.054132
C  -2.940926 -1.631514 -1.441352
C  -4.242401 -1.571746 0.60187
C  -4.084824 -1.326805 -2.16365
C  -5.372087 -1.245402 -0.133131
C  -5.292699 -1.124142 -1.51016
C  -1.642676 -1.725904 -2.17264
C  -1.13749 0.22019 1.694701
C  0.935239 1.503619 1.116456
C  2.650275 2.912668 0.816907
C  2.656588 0.805575 -0.1509
C  3.324156 1.999438 0.023137
C  -0.438182 -2.903386 -3.806544
C  2.580761 5.078356 1.733482
C  2.516095 -1.201677 -1.369601
H  -4.315718 -1.69016 1.672639
H  0.201115 -0.860785 0.548986
H  -4.034482 -1.231227 -3.239764
H  -6.313721 -1.096023 0.375752
H  -6.174106 -0.876489 -2.084994
H  -0.653998 2.100095 2.208116
H  4.282986 2.206767 -0.427222
H  -0.625486 -3.767137 -4.436126
H  0.419804 -3.106067 -3.165812
H  -0.235954 -2.034281 -4.430363
H  1.528887 5.182466 1.475419
H  1.545785 -0.916564 -1.772853
elementType: S F O N C H
totalener: -2122.26414968 hartree
nucrepener: 3573.25287028 hartree
electener: -5695.51701996 hartree
twoeener: 4333.77193112 hartree
cpcmener: -0.05099427 hartree
kineticenergy: 2115.04225379 hartree
xcener: -170.289296224042 hartree
chargesum: -0.0000000
charge: 0.887444 -0.196605 -0.195905 -0.195670 -0.193203 -0.501694 -0.509801 -0.266990 -0.453494 -0.478733 -0.258976 -0.260387 -0.199632 -0.135752 -0.408684 -0.424485 -0.127891 0.076357 -0.010228 -0.186446 -0.168757 -0.106647 0.466701 0.383205 0.396103 0.411163 0.411635 -0.290847 -0.124991 0.412007 0.401328 0.146345 0.223792 0.151551 0.169845 0.169736 0.196866 0.158963 0.139246 0.110451 0.126919 0.128589 0.127573
qa: 0.8874 -0.1966 -0.1959 -0.1957 -0.1932 -0.5017 -0.5098 -0.2670 -0.4535 -0.4787 -0.2590 -0.2604 -0.1996 -0.1358 -0.4087 -0.4245 -0.1279 0.0764 -0.0102 -0.1864 -0.1688 -0.1066 0.4667 0.3832 0.3961 0.4112 0.4116 -0.2908 -0.1250 0.4120 0.4013 0.1463 0.2238 0.1516 0.1698 0.1697 0.1969 0.1590 0.1392 0.1105 0.1269 0.1286 0.1276
va: 5.8053 1.0770 1.0875 1.0898 1.0686 1.9974 1.9792 2.1451 2.0488 2.0349 2.1411 2.1447 3.1081 3.2104 2.9687 2.9775 3.7659 3.6967 3.8439 4.0204 3.9519 3.8934 4.0699 4.3998 4.2287 4.0183 3.9945 3.9648 3.8510 4.2430 4.2160 1.0231 1.0396 1.0054 0.9862 0.9851 1.0136 1.0086 0.9949 0.9969 0.9914 0.9825 0.9961
dispcorr: -0.025011177 hartree
energy: -2122.289160859686
dipole: -24.22029 23.10290 -1.11739 -12.36145 14.34082 1.97937 -14.51490 11.37930 -3.13560
magnitude: 3.87278 au
magnitude: 9.84383 debye
