program: Orca
programVersion: 4.2.1
elementType: S F F F F O O O O O O O N N N N C C C C C C C C C C C C C C C H H H H H H H H H H H H
charge: 0
multiplicity: 1
keywords: wb97x-d3
keywords: def2-TZVPP
keywords: def2/J RIJCOSX GRIDX6 NOFINALGRIDX
keywords: grid4 nofinalgrid
keywords: scfconv7
keywords: smallprint printgap noloewdin
keywords: NOSOSCF
formula: C15H12F4N4O7S
InChI: InChI=1S/C15H12F4N4O7S/c1-28-11(24)7-4-2-3-5-8(7)31(26,27)23-15(25)22-14-20-9(29-12(16)17)6-10(21-14)30-13(18)19/h2-6,12-13,22-23H,1H3
43 atoms
S  -2.389691 -0.233284 -1.696957
F  0.349948 4.322698 0.757745
F  0.074494 3.12059 -1.014915
F  7.056723 -1.494026 0.556538
F  5.280329 -2.396414 1.391145
O  -2.642631 -0.79991 -3.003618
O  -2.685768 1.164856 -1.44674
O  -3.726314 1.434721 1.665646
O  -1.62818 0.722546 1.357824
O  -0.649242 -2.60486 -1.729406
O  1.85202 2.837464 0.309212
O  5.26441 -0.296297 0.647889
N  -0.766726 -0.372495 -1.34976
N  1.187193 -1.568779 -0.937361
N  1.477563 0.657386 -0.309995
N  3.214443 -0.927808 -0.150464
C  -3.222283 -1.213842 -0.481234
C  -3.437004 -0.709991 0.803068
C  -3.739485 -2.439968 -0.866747
C  -4.182987 -1.462194 1.697592
C  -4.465097 -3.189292 0.047507
C  -4.686186 -2.70106 1.323894
C  -2.821091 0.561183 1.286812
C  -0.119497 -1.576082 -1.366784
C  1.978957 -0.5599 -0.448919
C  2.299568 1.580751 0.161158
C  4.003222 0.015729 0.317257
C  3.611236 1.330817 0.504507
C  -3.254761 2.684456 2.187161
C  0.494106 3.088671 0.263111
C  5.728515 -1.580064 0.422572
H  -3.592173 -2.815245 -1.868672
H  -0.291502 0.436308 -0.942356
H  -4.362925 -1.090387 2.697192
H  -4.862503 -4.149767 -0.248486
H  -5.258381 -3.279988 2.035307
H  1.636325 -2.473957 -0.99397
H  4.271642 2.092288 0.891015
H  -2.630605 2.536071 3.066916
H  -4.143376 3.243982 2.461088
H  -2.700635 3.23906 1.429834
H  -0.101243 2.379718 0.836705
H  5.470842 -1.981878 -0.555104
elementType: S F O N C H
totalener: -2122.26398074 hartree
nucrepener: 3576.66692665 hartree
electener: -5698.93090739 hartree
twoeener: 4337.26326393 hartree
cpcmener: -0.05082167 hartree
kineticenergy: 2115.04594865 hartree
xcener: -170.290173189388 hartree
chargesum: -0.0000000
charge: 0.887507 -0.195729 -0.192133 -0.195855 -0.195660 -0.502914 -0.510928 -0.267645 -0.453514 -0.478523 -0.260633 -0.259505 -0.199024 -0.136965 -0.422638 -0.408561 -0.133898 0.078774 -0.007358 -0.191163 -0.168547 -0.104263 0.469450 0.383164 0.394639 0.414998 0.414315 -0.295313 -0.122622 0.413789 0.411057 0.147189 0.223052 0.152598 0.170233 0.169058 0.196257 0.158423 0.126184 0.139809 0.110032 0.112821 0.130043
qa: 0.8875 -0.1957 -0.1921 -0.1959 -0.1957 -0.5029 -0.5109 -0.2676 -0.4535 -0.4785 -0.2606 -0.2595 -0.1990 -0.1370 -0.4226 -0.4086 -0.1339 0.0788 -0.0074 -0.1912 -0.1685 -0.1043 0.4695 0.3832 0.3946 0.4150 0.4143 -0.2953 -0.1226 0.4138 0.4111 0.1472 0.2231 0.1526 0.1702 0.1691 0.1963 0.1584 0.1262 0.1398 0.1100 0.1128 0.1300
va: 5.8071 1.0904 1.0720 1.0879 1.0777 1.9957 1.9781 2.1475 2.0465 2.0348 2.1484 2.1411 3.1073 3.2110 2.9786 2.9674 3.7704 3.6900 3.8406 4.0236 3.9539 3.8944 4.0665 4.4009 4.2317 3.9911 4.0150 3.9625 3.8499 4.2268 4.2423 1.0224 1.0415 1.0060 0.9863 0.9854 1.0139 1.0089 0.9919 0.9945 0.9961 1.0001 0.9823
dispcorr: -0.024977939 hartree
energy: -2122.288958679024
dipole: -27.51581 27.61248 0.09668 -4.88497 4.34065 -0.54432 6.97440 -4.14902 2.82538
magnitude: 2.87896 au
magnitude: 7.31773 debye
