program: Orca
programVersion: 4.2.1
elementType: S F F F F O O O O O O O N N N N C C C C C C C C C C C C C C C H H H H H H H H H H H H
charge: 0
multiplicity: 1
keywords: wb97x-d3
keywords: def2-TZVPP
keywords: def2/J RIJCOSX GRIDX6 NOFINALGRIDX
keywords: grid4 nofinalgrid
keywords: scfconv7
keywords: smallprint printgap noloewdin
keywords: NOSOSCF
formula: C15H12F4N4O7S
InChI: InChI=1S/C15H12F4N4O7S/c1-28-11(24)7-4-2-3-5-8(7)31(26,27)23-15(25)22-14-20-9(29-12(16)17)6-10(21-14)30-13(18)19/h2-6,12-13,22-23H,1H3
43 atoms
S  -1.628423 -2.290152 0.87206
F  2.699749 4.798883 3.026592
F  3.163231 6.212638 1.457557
F  3.271079 -1.766121 -2.338133
F  2.413526 -2.118934 -0.387274
O  -2.080201 -2.748489 2.165489
O  -0.821855 -3.154589 0.031546
O  -1.606385 -2.715072 -2.998244
O  -0.736213 -0.89646 -2.026813
O  -2.194296 0.227844 2.302006
O  3.18703 4.112358 0.968339
O  3.229748 -0.118029 -0.947925
N  -0.684931 -0.929344 1.065706
N  -0.279665 1.265261 1.729694
N  1.456682 2.67029 1.350352
N  1.463297 0.530359 0.365418
C  -3.030193 -1.746687 -0.06252
C  -2.927214 -1.588847 -1.444705
C  -4.237191 -1.566444 0.593367
C  -4.060807 -1.240889 -2.163307
C  -5.357456 -1.199843 -0.137341
C  -5.268389 -1.037077 -1.509653
C  -1.625007 -1.697379 -2.169322
C  -1.126964 0.178575 1.73451
C  0.925877 1.481106 1.114465
C  2.612469 2.919085 0.773986
C  2.629772 0.810306 -0.19257
C  3.282425 2.016297 -0.035232
C  -0.401931 -2.939069 -3.739395
C  2.530191 5.063587 1.720237
C  2.518012 -1.21604 -1.379088
H  -4.315807 -1.713753 1.660542
H  0.195424 -0.878793 0.547768
H  -4.002666 -1.114376 -3.236277
H  -6.299565 -1.049625 0.371244
H  -6.142491 -0.755313 -2.080826
H  -0.625275 2.049879 2.267782
H  4.228963 2.236928 -0.50564
H  -0.608008 -3.781649 -4.392432
H  0.419282 -3.199263 -3.071244
H  -0.130272 -2.07194 -4.339612
H  1.468998 5.157367 1.494047
H  1.530759 -0.971482 -1.768824
elementType: S F O N C H
totalener: -2122.26863549 hartree
nucrepener: 3578.50546152 hartree
electener: -5700.77409701 hartree
twoeener: 4338.80637375 hartree
cpcmener: -0.04158782 hartree
kineticenergy: 2115.07851646 hartree
xcener: -170.294055563619 hartree
chargesum: -0.0000000
charge: 0.878815 -0.194135 -0.194311 -0.195476 -0.190281 -0.484590 -0.500441 -0.260073 -0.439623 -0.450939 -0.255435 -0.256670 -0.201351 -0.141388 -0.409777 -0.421864 -0.134548 0.083145 -0.010108 -0.182943 -0.165740 -0.109761 0.447185 0.369498 0.392551 0.407745 0.409796 -0.293984 -0.130510 0.411369 0.405883 0.146261 0.222430 0.148493 0.166108 0.166104 0.193552 0.157108 0.138990 0.113185 0.123995 0.123767 0.117968
qa: 0.8788 -0.1941 -0.1943 -0.1955 -0.1903 -0.4846 -0.5004 -0.2601 -0.4396 -0.4509 -0.2554 -0.2567 -0.2014 -0.1414 -0.4098 -0.4219 -0.1345 0.0831 -0.0101 -0.1829 -0.1657 -0.1098 0.4472 0.3695 0.3926 0.4077 0.4098 -0.2940 -0.1305 0.4114 0.4059 0.1463 0.2224 0.1485 0.1661 0.1661 0.1936 0.1571 0.1390 0.1132 0.1240 0.1238 0.1180
va: 5.8196 1.0803 1.0898 1.0905 1.0735 2.0198 1.9896 2.1472 2.0625 2.0682 2.1469 2.1513 3.1045 3.2048 2.9660 2.9786 3.7887 3.6887 3.8520 4.0221 3.9506 3.8970 4.0961 4.4143 4.2321 4.0227 3.9994 3.9618 3.8538 4.2491 4.2236 1.0230 1.0397 1.0054 0.9876 0.9865 1.0160 1.0093 0.9952 0.9960 0.9917 0.9839 1.0012
dispcorr: -0.025163025 hartree
energy: -2122.293798515717
dipole: -24.07427 22.94737 -1.12690 -12.30279 14.13085 1.82806 -14.21830 11.32627 -2.89202
magnitude: 3.60215 au
magnitude: 9.15595 debye
