program: Orca
programVersion: 4.2.1
elementType: S F F F F O O O O O O O N N N N C C C C C C C C C C C C C C C H H H H H H H H H H H H
charge: 0
multiplicity: 1
keywords: wb97x-d3
keywords: def2-TZVPP
keywords: def2/J RIJCOSX GRIDX6 NOFINALGRIDX
keywords: grid4 nofinalgrid
keywords: scfconv7
keywords: smallprint printgap noloewdin
keywords: NOSOSCF
formula: C15H12F4N4O7S
InChI: InChI=1S/C15H12F4N4O7S/c1-28-11(24)7-4-2-3-5-8(7)31(26,27)23-15(25)22-14-20-9(29-12(16)17)6-10(21-14)30-13(18)19/h2-6,12-13,22-23H,1H3
43 atoms
S  -2.412296 -0.203732 -1.690843
F  0.358165 4.334117 0.762315
F  0.111806 3.15183 -1.029069
F  7.010088 -1.546336 0.590264
F  5.209139 -2.430831 1.39513
O  -2.687538 -0.74851 -2.999987
O  -2.699263 1.188931 -1.405353
O  -3.713874 1.429174 1.64813
O  -1.608709 0.717233 1.390014
O  -0.665237 -2.58025 -1.761666
O  1.850084 2.836921 0.335106
O  5.236248 -0.324699 0.674389
N  -0.784432 -0.351762 -1.359606
N  1.173875 -1.548233 -0.970637
N  1.468538 0.669582 -0.312421
N  3.193081 -0.926554 -0.151324
C  -3.219416 -1.207925 -0.474662
C  -3.405665 -0.724167 0.82035
C  -3.73082 -2.435334 -0.863806
C  -4.116375 -1.498204 1.725253
C  -4.421166 -3.20621 0.059244
C  -4.611692 -2.738985 1.348546
C  -2.79898 0.554982 1.297805
C  -0.138592 -1.555646 -1.391576
C  1.962298 -0.550261 -0.459897
C  2.290555 1.582426 0.177942
C  3.983401 0.004629 0.336604
C  3.598076 1.320516 0.534051
C  -3.262028 2.698762 2.130687
C  0.50079 3.103722 0.258574
C  5.68211 -1.608417 0.442169
H  -3.602822 -2.79281 -1.874832
H  -0.300325 0.459859 -0.969281
H  -4.273737 -1.141537 2.734333
H  -4.814103 -4.168675 -0.237564
H  -5.153908 -3.336964 2.068122
H  1.625346 -2.452125 -1.03288
H  4.258083 2.073539 0.937856
H  -2.617317 2.591527 3.001208
H  -4.157238 3.246521 2.408245
H  -2.737051 3.246832 1.348469
H  -0.117312 2.396222 0.809488
H  5.428872 -1.997483 -0.543091
elementType: S F O N C H
totalener: -2122.26851775 hartree
nucrepener: 3580.26172771 hartree
electener: -5702.53024545 hartree
twoeener: 4340.65008709 hartree
cpcmener: -0.04146861 hartree
kineticenergy: 2115.08224441 hartree
xcener: -170.294569701336 hartree
chargesum: -0.0000000
charge: 0.879258 -0.194798 -0.190660 -0.193996 -0.194670 -0.485877 -0.500747 -0.261610 -0.439442 -0.451132 -0.257029 -0.255512 -0.201037 -0.141768 -0.420989 -0.409613 -0.138147 0.083170 -0.005136 -0.189339 -0.166098 -0.106458 0.451613 0.368121 0.392545 0.412010 0.410048 -0.296925 -0.126847 0.419865 0.410031 0.145899 0.221601 0.149159 0.166337 0.165267 0.193017 0.156838 0.123725 0.138648 0.111747 0.103725 0.125206
qa: 0.8793 -0.1948 -0.1907 -0.1940 -0.1947 -0.4859 -0.5007 -0.2616 -0.4394 -0.4511 -0.2570 -0.2555 -0.2010 -0.1418 -0.4210 -0.4096 -0.1381 0.0832 -0.0051 -0.1893 -0.1661 -0.1065 0.4516 0.3681 0.3925 0.4120 0.4100 -0.2969 -0.1268 0.4199 0.4100 0.1459 0.2216 0.1492 0.1663 0.1653 0.1930 0.1568 0.1237 0.1386 0.1117 0.1037 0.1252
va: 5.8185 1.0921 1.0753 1.0903 1.0791 2.0181 1.9896 2.1485 2.0608 2.0685 2.1548 2.1460 3.1031 3.2043 2.9783 2.9648 3.7878 3.6860 3.8443 4.0261 3.9529 3.8978 4.0912 4.4168 4.2329 3.9969 4.0198 3.9602 3.8546 4.2329 4.2487 1.0231 1.0416 1.0062 0.9877 0.9868 1.0163 1.0095 0.9920 0.9947 0.9954 1.0036 0.9837
dispcorr: -0.025084466 hartree
energy: -2122.293602212203
dipole: -27.31192 27.37592 0.06400 -4.86676 4.32606 -0.54070 6.76228 -4.19452 2.56776
magnitude: 2.62485 au
magnitude: 6.67184 debye
