program: Orca
programVersion: 4.2.1
elementType: S F F F F O O O O O O O N N N N C C C C C C C C C C C C C C C H H H H H H H H H H H H
charge: 0
multiplicity: 1
keywords: wb97x-d3
keywords: def2-TZVPP
keywords: def2/J RIJCOSX GRIDX6 NOFINALGRIDX
keywords: grid4 nofinalgrid
keywords: scfconv7
keywords: smallprint printgap noloewdin
keywords: NOSOSCF
formula: C15H12F4N4O7S
InChI: InChI=1S/C15H12F4N4O7S/c1-28-11(24)7-4-2-3-5-8(7)31(26,27)23-15(25)22-14-20-9(29-12(16)17)6-10(21-14)30-13(18)19/h2-6,12-13,22-23H,1H3
43 atoms
S  -2.429637 -0.134669 -1.624842
F  0.34675 4.259745 0.872622
F  0.370638 3.279695 -1.057098
F  6.011311 -1.806658 -0.885374
F  6.794807 -1.839306 1.131678
O  -2.746736 -0.639917 -2.934169
O  -2.683612 1.242812 -1.262317
O  -3.654739 1.2747 2.003262
O  -1.580846 0.662702 1.436809
O  -0.683978 -2.561553 -1.768083
O  1.866397 2.769415 0.509055
O  5.251758 -0.403822 0.662919
N  -0.79252 -0.329827 -1.333684
N  1.176392 -1.535281 -1.020818
N  1.486909 0.649618 -0.276417
N  3.205625 -0.963057 -0.188835
C  -3.217806 -1.185129 -0.423033
C  -3.410644 -0.755957 0.889979
C  -3.742836 -2.387791 -0.865929
C  -4.158255 -1.551799 1.747085
C  -4.461595 -3.184696 0.011769
C  -4.673043 -2.764287 1.313298
C  -2.76855 0.474519 1.442252
C  -0.16324 -1.538595 -1.407485
C  1.972573 -0.566977 -0.475099
C  2.305704 1.533437 0.268863
C  3.999651 -0.058802 0.344311
C  3.613256 1.244341 0.615509
C  -3.160959 2.477534 2.585519
C  0.543956 3.091576 0.257922
C  5.684753 -1.688186 0.408378
H  -3.594658 -2.696505 -1.890267
H  -0.293592 0.461918 -0.92889
H  -4.331145 -1.229339 2.764974
H  -4.863332 -4.128491 -0.330226
H  -5.245681 -3.376746 1.996591
H  1.623181 -2.434058 -1.127642
H  4.274919 1.972124 1.058907
H  -4.02844 2.986533 2.995152
H  -2.689925 3.11281 1.835008
H  -2.444798 2.274423 3.382129
H  -0.161329 2.34768 0.628485
H  4.952268 -2.451834 0.67158
totalener: -2122.24299758 hartree
nucrepener: 3567.16152588 hartree
electener: -5689.40452346 hartree
twoeener: 4326.78373647 hartree
kineticenergy: 2115.11130629 hartree
xcener: -170.291729943105 hartree
chargesum: 0.0000000
charge: 0.869939 -0.180493 -0.172023 -0.174197 -0.173428 -0.425752 -0.464196 -0.249364 -0.404618 -0.372756 -0.244086 -0.240779 -0.209264 -0.170873 -0.412641 -0.402498 -0.200121 0.106729 0.037999 -0.184749 -0.142137 -0.091576 0.422616 0.343382 0.381090 0.391097 0.377934 -0.289788 -0.140502 0.442674 0.402446 0.140176 0.213957 0.123828 0.137191 0.134946 0.170392 0.142803 0.127027 0.116912 0.113703 0.058484 0.090517
qa: 0.8699 -0.1805 -0.1720 -0.1742 -0.1734 -0.4258 -0.4642 -0.2494 -0.4046 -0.3728 -0.2441 -0.2408 -0.2093 -0.1709 -0.4126 -0.4025 -0.2001 0.1067 0.0380 -0.1847 -0.1421 -0.0916 0.4226 0.3434 0.3811 0.3911 0.3779 -0.2898 -0.1405 0.4427 0.4024 0.1402 0.2140 0.1238 0.1372 0.1349 0.1704 0.1428 0.1270 0.1169 0.1137 0.0585 0.0905
va: 5.8316 1.1138 1.1124 1.1099 1.1179 2.0875 2.0286 2.1503 2.0881 2.1450 2.1828 2.1643 3.1204 3.1903 2.9751 2.9652 3.9348 3.6751 3.8645 4.0703 3.9771 3.9407 4.1115 4.4103 4.2305 4.0272 4.0594 3.9508 3.8878 4.2813 4.2879 1.0271 1.0462 1.0181 0.9984 0.9979 1.0339 1.0155 0.9959 0.9941 0.9922 1.0061 0.9918
dispcorr: -0.024730832 hartree
energy: -2122.267728413109
dipole: -28.67802 28.18214 -0.49588 -6.40074 5.68940 -0.71134 10.65763 -8.22351 2.43412
magnitude: 2.58396 au
magnitude: 6.56791 debye
