program: Orca
programVersion: 4.2.1
elementType: S F F F F O O O O O O O N N N N C C C C C C C C C C C C C C C H H H H H H H H H H H H
charge: 0
multiplicity: 1
keywords: wb97x-d3
keywords: def2-TZVPP
keywords: def2/J RIJCOSX GRIDX6 NOFINALGRIDX
keywords: grid4 nofinalgrid
keywords: scfconv7
keywords: smallprint printgap noloewdin
keywords: NOSOSCF
formula: C15H12F4N4O7S
InChI: InChI=1S/C15H12F4N4O7S/c1-28-11(24)7-4-2-3-5-8(7)31(26,27)23-15(25)22-14-20-9(29-12(16)17)6-10(21-14)30-13(18)19/h2-6,12-13,22-23H,1H3
43 atoms
S  -2.383624 -0.250154 -1.708162
F  0.346595 4.307917 0.697295
F  0.30841 3.187074 -1.153466
F  7.083616 -1.516062 0.46245
F  5.360743 -2.34677 1.474488
O  -2.629111 -0.859952 -2.987972
O  -2.658702 1.149767 -1.469313
O  -3.818731 1.465832 1.664657
O  -1.708104 0.810361 1.325411
O  -0.630559 -2.666186 -1.598801
O  1.868202 2.809109 0.388181
O  5.308997 -0.296984 0.615287
N  -0.761711 -0.411947 -1.318201
N  1.210254 -1.58198 -0.890903
N  1.500384 0.643758 -0.269626
N  3.248322 -0.935483 -0.141481
C  -3.229657 -1.205482 -0.468276
C  -3.492541 -0.667825 0.791064
C  -3.721281 -2.447868 -0.832834
C  -4.274259 -1.397178 1.675997
C  -4.476367 -3.175802 0.073542
C  -4.75586 -2.648784 1.322493
C  -2.893076 0.617192 1.2619
C  -0.122912 -1.617903 -1.296697
C  2.002801 -0.57308 -0.419136
C  2.319268 1.567891 0.204271
C  4.039422 0.00709 0.324979
C  3.63968 1.31778 0.53166
C  -3.371403 2.734611 2.133733
C  0.533993 3.098695 0.164626
C  5.752571 -1.590405 0.439813
H  -3.518627 -2.840367 -1.81831
H  -0.287631 0.409842 -0.94592
H  -4.501043 -0.991091 2.652585
H  -4.853442 -4.149974 -0.205368
H  -5.355681 -3.208806 2.027085
H  1.65912 -2.485464 -0.92524
H  4.300058 2.078396 0.918081
H  -4.265634 3.270887 2.436559
H  -2.868553 3.288601 1.340888
H  -2.697559 2.635439 2.984616
H  -0.148636 2.377864 0.614805
H  5.412325 -2.042522 -0.492207
totalener: -2122.24313177 hartree
nucrepener: 3564.10097567 hartree
electener: -5686.34410744 hartree
twoeener: 4323.80788522 hartree
kineticenergy: 2115.11521415 hartree
xcener: -170.292138974664 hartree
chargesum: -0.0000000
charge: 0.868373 -0.181116 -0.172388 -0.173184 -0.175712 -0.425650 -0.462025 -0.247918 -0.406027 -0.374001 -0.244338 -0.240934 -0.210657 -0.171320 -0.415623 -0.402482 -0.195571 0.108202 0.034649 -0.184313 -0.141734 -0.092214 0.421672 0.345480 0.381632 0.390500 0.377222 -0.289184 -0.144169 0.426401 0.401605 0.139679 0.216869 0.123752 0.137455 0.135083 0.171134 0.143166 0.128046 0.118413 0.113913 0.074987 0.092323
qa: 0.8684 -0.1811 -0.1724 -0.1732 -0.1757 -0.4257 -0.4620 -0.2479 -0.4060 -0.3740 -0.2443 -0.2409 -0.2107 -0.1713 -0.4156 -0.4025 -0.1956 0.1082 0.0346 -0.1843 -0.1417 -0.0922 0.4217 0.3455 0.3816 0.3905 0.3772 -0.2892 -0.1442 0.4264 0.4016 0.1397 0.2169 0.1238 0.1375 0.1351 0.1711 0.1432 0.1280 0.1184 0.1139 0.0750 0.0923
va: 5.8327 1.1124 1.1076 1.1184 1.1078 2.0884 2.0311 2.1514 2.0902 2.1434 2.1807 2.1644 3.1223 3.1891 2.9759 2.9652 3.9328 3.6804 3.8683 4.0695 3.9768 3.9421 4.1146 4.4079 4.2292 4.0288 4.0605 3.9497 3.8860 4.2690 4.2873 1.0274 1.0395 1.0173 0.9983 0.9977 1.0338 1.0155 0.9959 0.9937 0.9921 1.0082 0.9912
dispcorr: -0.024641842 hartree
energy: -2122.267773611339
dipole: -28.41348 28.04237 -0.37111 -4.79253 4.44347 -0.34906 6.96234 -5.20621 1.75613
magnitude: 1.82854 au
magnitude: 4.64779 debye
